{"text_format":"1","workbook":"xlsx","n_sheets":16,"sheets":["銘柄一覧","8053","8031","7984","7976","7971","7962","7949","7921","7893","7846","7832","7762","7732","7596","証券コード一覧"],"not_rendered":{"charts":0,"images":0,"macros":1,"external_links":0,"defined_names":56,"comments":0,"pivot_tables":0},"unopened":[],"bounds":{"document_bytes":16777216,"sheet_cells":100000,"rows_first":2000,"rows_last":500,"rows_between":2000,"halvings":0,"cell_chars":16384,"cell_head_chars":4096},"cells_cut":0,"cells_raw":0,"read":"whole","date_system":"1900"}

{"sheet":"銘柄一覧","index":0,"n_rows":113,"n_cols":9,"rows_kept":113,"cut":false,"hidden":false,"merged":[]}
["財産評価のための上場株式の最終価格自動計算シート"]
[]
[null,null,"相続発生日","2018-03-22"]
[null,null,"相続月",{"$f":"EOMONTH($D$3,0)","v":"2018-03-31"},null,{"$f":"YEAR(D4)","v":2018},{"$f":"MONTH(D4)","v":3},{"$f":"DAY(D4)","v":31},{"$f":"D5+1","v":"2018-03-01"}]
[null,null,"相続月の前月",{"$f":"EOMONTH($D$3,-1)","v":"2018-02-28"},null,{"$f":"YEAR(D5)","v":2018},{"$f":"MONTH(D5)","v":2},{"$f":"DAY(D5)","v":28},{"$f":"EOMONTH($I$4,-2)+1","v":"2018-02-01"}]
[null,null,"相続月の前々月",{"$f":"EOMONTH($D$3,-2)","v":"2018-01-31"},null,2018,1,31,{"$f":"EOMONTH($I$4,-3)+1","v":"2018-01-01"}]
[]
[]
[null,null,"証券コード","社名","市場"]
[null,null,7596,{"$f":"IF(ISERROR(VLOOKUP(C10,証券コード一覧!A:B,2,FALSE)),\"証券コード一覧に対応する銘柄がありません\",VLOOKUP(C10,証券コード一覧!A:B,2,FALSE))","v":"魚力"},{"$f":"IF(ISERROR(VLOOKUP(C10,証券コード一覧!A:C,3,FALSE)),\"証券コード一覧に対応する銘柄がありません\",VLOOKUP(C10,証券コード一覧!A:C,3,FALSE))","v":"市場第一部（内国株）"}]
[null,null,7732,{"$f":"IF(ISERROR(VLOOKUP(C11,証券コード一覧!A:B,2,FALSE)),\"証券コード一覧に対応する銘柄がありません\",VLOOKUP(C11,証券コード一覧!A:B,2,FALSE))","v":"トプコン"},{"$f":"IF(ISERROR(VLOOKUP(C11,証券コード一覧!A:C,3,FALSE)),\"証券コード一覧に対応する銘柄がありません\",VLOOKUP(C11,証券コード一覧!A:C,3,FALSE))","v":"市場第一部（内国株）"}]
[null,null,7762,{"$f":"IF(ISERROR(VLOOKUP(C12,証券コード一覧!A:B,2,FALSE)),\"証券コード一覧に対応する銘柄がありません\",VLOOKUP(C12,証券コード一覧!A:B,2,FALSE))","v":"シチズンホールディングス"},{"$f":"IF(ISERROR(VLOOKUP(C12,証券コード一覧!A:C,3,FALSE)),\"証券コード一覧に対応する銘柄がありません\",VLOOKUP(C12,証券コード一覧!A:C,3,FALSE))","v":"市場第一部（内国株）"}]
[null,null,7832,{"$f":"IF(ISERROR(VLOOKUP(C13,証券コード一覧!A:B,2,FALSE)),\"証券コード一覧に対応する銘柄がありません\",VLOOKUP(C13,証券コード一覧!A:B,2,FALSE))","v":"バンダイナムコホールディングス"},{"$f":"IF(ISERROR(VLOOKUP(C13,証券コード一覧!A:C,3,FALSE)),\"証券コード一覧に対応する銘柄がありません\",VLOOKUP(C13,証券コード一覧!A:C,3,FALSE))","v":"市場第一部（内国株）"}]
[null,null,7846,{"$f":"IF(ISERROR(VLOOKUP(C14,証券コード一覧!A:B,2,FALSE)),\"証券コード一覧に対応する銘柄がありません\",VLOOKUP(C14,証券コード一覧!A:B,2,FALSE))","v":"パイロットコーポレーション"},{"$f":"IF(ISERROR(VLOOKUP(C14,証券コード一覧!A:C,3,FALSE)),\"証券コード一覧に対応する銘柄がありません\",VLOOKUP(C14,証券コード一覧!A:C,3,FALSE))","v":"市場第一部（内国株）"}]
[null,null,7893,{"$f":"IF(ISERROR(VLOOKUP(C15,証券コード一覧!A:B,2,FALSE)),\"証券コード一覧に対応する銘柄がありません\",VLOOKUP(C15,証券コード一覧!A:B,2,FALSE))","v":"プロネクサス"},{"$f":"IF(ISERROR(VLOOKUP(C15,証券コード一覧!A:C,3,FALSE)),\"証券コード一覧に対応する銘柄がありません\",VLOOKUP(C15,証券コード一覧!A:C,3,FALSE))","v":"市場第一部（内国株）"}]
[null,null,7921,{"$f":"IF(ISERROR(VLOOKUP(C16,証券コード一覧!A:B,2,FALSE)),\"証券コード一覧に対応する銘柄がありません\",VLOOKUP(C16,証券コード一覧!A:B,2,FALSE))","v":"宝印刷"},{"$f":"IF(ISERROR(VLOOKUP(C16,証券コード一覧!A:C,3,FALSE)),\"証券コード一覧に対応する銘柄がありません\",VLOOKUP(C16,証券コード一覧!A:C,3,FALSE))","v":"市場第一部（内国株）"}]
[null,null,7949,{"$f":"IF(ISERROR(VLOOKUP(C17,証券コード一覧!A:B,2,FALSE)),\"証券コード一覧に対応する銘柄がありません\",VLOOKUP(C17,証券コード一覧!A:B,2,FALSE))","v":"小松ウオール工業"},{"$f":"IF(ISERROR(VLOOKUP(C17,証券コード一覧!A:C,3,FALSE)),\"証券コード一覧に対応する銘柄がありません\",VLOOKUP(C17,証券コード一覧!A:C,3,FALSE))","v":"市場第一部（内国株）"}]
[null,null,7962,{"$f":"IF(ISERROR(VLOOKUP(C18,証券コード一覧!A:B,2,FALSE)),\"証券コード一覧に対応する銘柄がありません\",VLOOKUP(C18,証券コード一覧!A:B,2,FALSE))","v":"キングジム"},{"$f":"IF(ISERROR(VLOOKUP(C18,証券コード一覧!A:C,3,FALSE)),\"証券コード一覧に対応する銘柄がありません\",VLOOKUP(C18,証券コード一覧!A:C,3,FALSE))","v":"市場第一部（内国株）"}]
[null,null,7971,{"$f":"IF(ISERROR(VLOOKUP(C19,証券コード一覧!A:B,2,FALSE)),\"証券コード一覧に対応する銘柄がありません\",VLOOKUP(C19,証券コード一覧!A:B,2,FALSE))","v":"東リ"},{"$f":"IF(ISERROR(VLOOKUP(C19,証券コード一覧!A:C,3,FALSE)),\"証券コード一覧に対応する銘柄がありません\",VLOOKUP(C19,証券コード一覧!A:C,3,FALSE))","v":"市場第一部（内国株）"}]
[null,null,7976,{"$f":"IF(ISERROR(VLOOKUP(C20,証券コード一覧!A:B,2,FALSE)),\"証券コード一覧に対応する銘柄がありません\",VLOOKUP(C20,証券コード一覧!A:B,2,FALSE))","v":"三菱鉛筆"},{"$f":"IF(ISERROR(VLOOKUP(C20,証券コード一覧!A:C,3,FALSE)),\"証券コード一覧に対応する銘柄がありません\",VLOOKUP(C20,証券コード一覧!A:C,3,FALSE))","v":"市場第一部（内国株）"}]
{"$rows_left_out":94}
{"sheet":"8053","index":1,"n_rows":62,"n_cols":10,"rows_kept":62,"cut":false,"hidden":false,"merged":[]}
["証券コード","会社名"]
[8053,"住友商事"]
["市場","市場第一部（内国株）",null,"日付","始値","高値","安値","終値","出来高","調整後終値*"]
["相続日","2018-03-22",null,"2018-01-04",1935.5,1988.5,1931.5,1988.5,6014000,1988.5]
["相続日の終値",1785,null,"2018-01-05",1993,2006,1980,1992.5,4287600,1992.5]
["相続当月の終値の平均",1785.5952380952381,null,"2018-01-09",2016,2043.5,1997.5,2005.5,5534600,2005.5]
["相続前月の終値の平均",1845.2368421052631,null,"2018-01-10",2001,2013,1998,2004,3758900,2004]
["相続前々月の終値の平均",1967.9736842105262,null,"2018-01-11",1995,2019.5,1992.5,2019.5,3454700,2019.5]
["４つのうちの最低額",{"$f":"ROUNDDOWN(MIN(B5:B8),0)","v":1785},null,"2018-01-12",2018.5,2020,1988,2000,4484900,2000]
[null,null,null,"2018-01-15",2020,2033,2010.5,2021,2707200,2021]
[null,null,null,"2018-01-16",2019.5,2019.5,1994,1995.5,3052100,1995.5]
[null,null,null,"2018-01-17",1984,1988.5,1968,1972,3421200,1972]
[null,null,null,"2018-01-18",1987.5,1987.5,1934.5,1940,5013500,1940]
[null,null,null,"2018-01-19",1949,1974,1938,1973,3624400,1973]
[null,null,null,"2018-01-22",1965,1968,1931,1941,3335600,1941]
[null,null,null,"2018-01-23",1946,1958.5,1939.5,1947,2598100,1947]
[null,null,null,"2018-01-24",1935,1954,1934,1939.5,3198100,1939.5]
[null,null,null,"2018-01-25",1930,1966.5,1930,1963,4114000,1963]
[null,null,null,"2018-01-26",1956,1958.5,1925.5,1928,4652100,1928]
[null,null,null,"2018-01-29",1920.5,1956.5,1912.5,1953,3372500,1953]
{"$rows_left_out":43}
{"sheet":"8031","index":2,"n_rows":62,"n_cols":10,"rows_kept":62,"cut":false,"hidden":false,"merged":[]}
["証券コード","会社名"]
[8031,"三井物産"]
["市場","市場第一部（内国株）",null,"日付","始値","高値","安値","終値","出来高","調整後終値*"]
["相続日","2018-03-22",null,"2018-01-04",1855,1895.5,1854.5,1895.5,12670900,1895.5]
["相続日の終値",1839.5,null,"2018-01-05",1900,1922.5,1898,1922.5,9318500,1922.5]
["相続当月の終値の平均",1861.8095238095239,null,"2018-01-09",1948,1952,1925,1929,8353800,1929]
["相続前月の終値の平均",1932.9736842105262,null,"2018-01-10",1934,1945.5,1924,1935,7253600,1935]
["相続前々月の終値の平均",1938.6315789473683,null,"2018-01-11",1925,1956.5,1921.5,1956.5,6896700,1956.5]
["４つのうちの最低額",{"$f":"ROUNDDOWN(MIN(B5:B8),0)","v":1839},null,"2018-01-12",1956.5,1964,1941,1955,7078700,1955]
[null,null,null,"2018-01-15",1972.5,1979.5,1960.5,1963.5,4828300,1963.5]
[null,null,null,"2018-01-16",1968,1974,1959,1965.5,4637200,1965.5]
[null,null,null,"2018-01-17",1952.5,1959.5,1936.5,1943,7769900,1943]
[null,null,null,"2018-01-18",1957,1958,1925,1929,9200600,1929]
[null,null,null,"2018-01-19",1928,1948.5,1924,1941.5,6479600,1941.5]
[null,null,null,"2018-01-22",1930,1938,1911.5,1921,4960500,1921]
[null,null,null,"2018-01-23",1930,1935.5,1923,1931,5091800,1931]
[null,null,null,"2018-01-24",1925,1949.5,1923,1949,7607100,1949]
[null,null,null,"2018-01-25",1950,1961.5,1933.5,1961.5,6951400,1961.5]
[null,null,null,"2018-01-26",1966.5,1968.5,1938.5,1944,8805400,1944]
[null,null,null,"2018-01-29",1949,1955,1933.5,1953.5,5131300,1953.5]
{"$rows_left_out":43}
{"sheet":"7984","index":3,"n_rows":62,"n_cols":10,"rows_kept":62,"cut":false,"hidden":false,"merged":[]}
["証券コード","会社名"]
[7984,"コクヨ"]
["市場","市場第一部（内国株）",null,"日付","始値","高値","安値","終値","出来高","調整後終値*"]
["相続日","2018-03-22",null,"2018-01-04",2100,2110,2075,2099,295500,2099]
["相続日の終値",2052,null,"2018-01-05",2102,2126,2088,2125,214900,2125]
["相続当月の終値の平均",2012.1904761904761,null,"2018-01-09",2130,2148,2130,2147,245300,2147]
["相続前月の終値の平均",1954.6842105263158,null,"2018-01-10",2143,2143,2106,2120,264900,2120]
["相続前々月の終値の平均",2116.7368421052633,null,"2018-01-11",2115,2126,2107,2126,131100,2126]
["４つのうちの最低額",{"$f":"ROUNDDOWN(MIN(B5:B8),0)","v":1954},null,"2018-01-12",2123,2146,2118,2143,198400,2143]
[null,null,null,"2018-01-15",2150,2180,2122,2127,238900,2127]
[null,null,null,"2018-01-16",2131,2178,2129,2159,251500,2159]
[null,null,null,"2018-01-17",2140,2172,2140,2164,173600,2164]
[null,null,null,"2018-01-18",2168,2170,2094,2095,402300,2095]
[null,null,null,"2018-01-19",2118,2154,2118,2137,270300,2137]
[null,null,null,"2018-01-22",2140,2144,2104,2114,179100,2114]
[null,null,null,"2018-01-23",2127,2134,2108,2126,170600,2126]
[null,null,null,"2018-01-24",2122,2128,2105,2109,136100,2109]
[null,null,null,"2018-01-25",2103,2113,2089,2091,163600,2091]
[null,null,null,"2018-01-26",2100,2147,2095,2113,274600,2113]
[null,null,null,"2018-01-29",2123,2140,2116,2130,173700,2130]
{"$rows_left_out":43}
{"sheet":"7976","index":4,"n_rows":62,"n_cols":10,"rows_kept":62,"cut":false,"hidden":false,"merged":[]}
["証券コード","会社名"]
[7976,"三菱鉛筆"]
["市場","市場第一部（内国株）",null,"日付","始値","高値","安値","終値","出来高","調整後終値*"]
["相続日","2018-03-22",null,"2018-01-04",2487,2497,2463,2483,63000,2483]
["相続日の終値",2348,null,"2018-01-05",2500,2534,2485,2533,96300,2533]
["相続当月の終値の平均",2358.7142857142858,null,"2018-01-09",2546,2550,2511,2531,86300,2531]
["相続前月の終値の平均",2406.9473684210525,null,"2018-01-10",2542,2545,2498,2502,79600,2502]
["相続前々月の終値の平均",2516,null,"2018-01-11",2500,2500,2463,2492,66300,2492]
["４つのうちの最低額",{"$f":"ROUNDDOWN(MIN(B5:B8),0)","v":2348},null,"2018-01-12",2490,2510,2480,2488,52800,2488]
[null,null,null,"2018-01-15",2502,2518,2496,2497,44700,2497]
[null,null,null,"2018-01-16",2507,2520,2497,2510,49200,2510]
[null,null,null,"2018-01-17",2502,2539,2502,2524,91300,2524]
[null,null,null,"2018-01-18",2545,2550,2528,2529,128900,2529]
[null,null,null,"2018-01-19",2540,2569,2529,2546,118300,2546]
[null,null,null,"2018-01-22",2550,2594,2549,2584,167600,2584]
[null,null,null,"2018-01-23",2600,2611,2571,2580,84700,2580]
[null,null,null,"2018-01-24",2570,2582,2543,2548,71300,2548]
[null,null,null,"2018-01-25",2535,2538,2514,2514,90000,2514]
[null,null,null,"2018-01-26",2520,2546,2504,2505,92200,2505]
[null,null,null,"2018-01-29",2543,2544,2510,2512,75600,2512]
{"$rows_left_out":43}
{"sheet":"7971","index":5,"n_rows":62,"n_cols":10,"rows_kept":62,"cut":false,"hidden":false,"merged":[]}
["証券コード","会社名"]
[7971,"東リ"]
["市場","市場第一部（内国株）",null,"日付","始値","高値","安値","終値","出来高","調整後終値*"]
["相続日","2018-03-22",null,"2018-01-04",445,468,444,468,255000,468]
["相続日の終値",392,null,"2018-01-05",468,471,461,462,135800,462]
["相続当月の終値の平均",384,null,"2018-01-09",464,464,455,456,86600,456]
["相続前月の終値の平均",388.94736842105266,null,"2018-01-10",456,456,445,445,79800,445]
["相続前々月の終値の平均",445.94736842105266,null,"2018-01-11",445,445,436,437,96300,437]
["４つのうちの最低額",{"$f":"ROUNDDOWN(MIN(B5:B8),0)","v":384},null,"2018-01-12",439,443,438,438,66700,438]
[null,null,null,"2018-01-15",443,445,441,443,48000,443]
[null,null,null,"2018-01-16",448,450,445,445,44900,445]
[null,null,null,"2018-01-17",445,449,440,441,63400,441]
[null,null,null,"2018-01-18",448,449,442,445,88000,445]
[null,null,null,"2018-01-19",440,449,440,447,51600,447]
[null,null,null,"2018-01-22",447,447,441,445,53900,445]
[null,null,null,"2018-01-23",450,452,447,450,49900,450]
[null,null,null,"2018-01-24",450,451,443,443,56300,443]
[null,null,null,"2018-01-25",444,444,439,440,41400,440]
[null,null,null,"2018-01-26",439,444,439,441,35400,441]
[null,null,null,"2018-01-29",445,446,442,444,55000,444]
{"$rows_left_out":43}
{"sheet":"7962","index":6,"n_rows":62,"n_cols":10,"rows_kept":62,"cut":false,"hidden":false,"merged":[]}
["証券コード","会社名"]
[7962,"キングジム"]
["市場","市場第一部（内国株）",null,"日付","始値","高値","安値","終値","出来高","調整後終値*"]
["相続日","2018-03-22",null,"2018-01-04",1030,1030,1023,1029,12900,1029]
["相続日の終値",1013,null,"2018-01-05",1029,1029,1024,1029,13500,1029]
["相続当月の終値の平均",988.09523809523807,null,"2018-01-09",1030,1030,1023,1026,16300,1026]
["相続前月の終値の平均",988.26315789473688,null,"2018-01-10",1025,1029,1022,1024,8100,1024]
["相続前々月の終値の平均",1015.2105263157895,null,"2018-01-11",1026,1030,1023,1030,13400,1030]
["４つのうちの最低額",{"$f":"ROUNDDOWN(MIN(B5:B8),0)","v":988},null,"2018-01-12",1030,1030,1008,1011,35600,1011]
[null,null,null,"2018-01-15",1020,1023,1012,1014,11400,1014]
[null,null,null,"2018-01-16",1014,1018,1002,1005,21200,1005]
[null,null,null,"2018-01-17",1009,1019,1006,1017,16300,1017]
[null,null,null,"2018-01-18",1023,1023,1011,1011,15100,1011]
[null,null,null,"2018-01-19",1011,1017,1008,1008,10400,1008]
[null,null,null,"2018-01-22",1010,1016,1008,1015,15900,1015]
[null,null,null,"2018-01-23",1020,1023,1017,1020,18500,1020]
[null,null,null,"2018-01-24",1024,1024,1013,1017,18600,1017]
[null,null,null,"2018-01-25",1020,1020,1009,1009,15900,1009]
[null,null,null,"2018-01-26",1015,1016,1007,1007,17700,1007]
[null,null,null,"2018-01-29",1034,1036,1011,1011,42800,1011]
{"$rows_left_out":43}
{"sheet":"7949","index":7,"n_rows":62,"n_cols":10,"rows_kept":62,"cut":false,"hidden":false,"merged":[]}
["証券コード","会社名"]
[7949,"小松ウオール工業"]
["市場","市場第一部（内国株）",null,"日付","始値","高値","安値","終値","出来高","調整後終値*"]
["相続日","2018-03-22",null,"2018-01-04",2425,2429,2410,2428,8000,2428]
["相続日の終値",2788,null,"2018-01-05",2428,2428,2402,2412,7600,2412]
["相続当月の終値の平均",2700.9523809523807,null,"2018-01-09",2413,2419,2405,2413,8500,2413]
["相続前月の終値の平均",2490.8947368421054,null,"2018-01-10",2414,2418,2392,2401,10000,2401]
["相続前々月の終値の平均",2433.3157894736842,null,"2018-01-11",2393,2447,2393,2433,15300,2433]
["４つのうちの最低額",{"$f":"ROUNDDOWN(MIN(B5:B8),0)","v":2433},null,"2018-01-12",2421,2421,2406,2412,7800,2412]
[null,null,null,"2018-01-15",2400,2412,2391,2393,20900,2393]
[null,null,null,"2018-01-16",2393,2424,2393,2409,14000,2409]
[null,null,null,"2018-01-17",2401,2420,2401,2409,7100,2409]
[null,null,null,"2018-01-18",2409,2417,2385,2392,14600,2392]
[null,null,null,"2018-01-19",2400,2405,2391,2398,5500,2398]
[null,null,null,"2018-01-22",2388,2414,2384,2404,7200,2404]
[null,null,null,"2018-01-23",2414,2438,2408,2425,6600,2425]
[null,null,null,"2018-01-24",2450,2525,2446,2514,49100,2514]
[null,null,null,"2018-01-25",2515,2515,2450,2459,43700,2459]
[null,null,null,"2018-01-26",2459,2484,2458,2472,10600,2472]
[null,null,null,"2018-01-29",2471,2500,2471,2487,6900,2487]
{"$rows_left_out":43}
{"sheet":"7921","index":8,"n_rows":62,"n_cols":10,"rows_kept":62,"cut":false,"hidden":false,"merged":[]}
["証券コード","会社名"]
[7921,"宝印刷"]
["市場","市場第一部（内国株）",null,"日付","始値","高値","安値","終値","出来高","調整後終値*"]
["相続日","2018-03-22",null,"2018-01-04",1787,1793,1780,1788,18200,1788]
["相続日の終値",1880,null,"2018-01-05",1786,1789,1774,1775,17600,1775]
["相続当月の終値の平均",1863.2380952380952,null,"2018-01-09",1790,1790,1770,1773,14700,1773]
["相続前月の終値の平均",1795.2631578947369,null,"2018-01-10",1783,1790,1777,1778,18900,1778]
["相続前々月の終値の平均",1765.7894736842106,null,"2018-01-11",1778,1787,1777,1780,10500,1780]
["４つのうちの最低額",{"$f":"ROUNDDOWN(MIN(B5:B8),0)","v":1765},null,"2018-01-12",1774,1779,1760,1760,18100,1760]
[null,null,null,"2018-01-15",1776,1776,1759,1760,9500,1760]
[null,null,null,"2018-01-16",1756,1766,1755,1756,9100,1756]
[null,null,null,"2018-01-17",1756,1758,1741,1745,20600,1745]
[null,null,null,"2018-01-18",1765,1765,1741,1749,20000,1749]
[null,null,null,"2018-01-19",1752,1766,1752,1757,14500,1757]
[null,null,null,"2018-01-22",1774,1783,1764,1782,26800,1782]
[null,null,null,"2018-01-23",1792,1792,1774,1778,16000,1778]
[null,null,null,"2018-01-24",1780,1790,1776,1785,11700,1785]
[null,null,null,"2018-01-25",1790,1790,1770,1770,9200,1770]
[null,null,null,"2018-01-26",1777,1784,1759,1759,17200,1759]
[null,null,null,"2018-01-29",1771,1771,1762,1762,7300,1762]
{"$rows_left_out":43}
{"sheet":"7893","index":9,"n_rows":62,"n_cols":10,"rows_kept":62,"cut":false,"hidden":false,"merged":[]}
["証券コード","会社名"]
[7893,"プロネクサス"]
["市場","市場第一部（内国株）",null,"日付","始値","高値","安値","終値","出来高","調整後終値*"]
["相続日","2018-03-22",null,"2018-01-04",1578,1604,1578,1597,19200,1597]
["相続日の終値",1277,null,"2018-01-05",1601,1610,1507,1563,29300,1563]
["相続当月の終値の平均",1277.2380952380952,null,"2018-01-09",1570,1570,1538,1544,13900,1544]
["相続前月の終値の平均",1346.2105263157894,null,"2018-01-10",1545,1545,1510,1524,8500,1524]
["相続前々月の終値の平均",1518.6842105263158,null,"2018-01-11",1518,1530,1518,1521,6200,1521]
["４つのうちの最低額",{"$f":"ROUNDDOWN(MIN(B5:B8),0)","v":1277},null,"2018-01-12",1518,1518,1477,1484,17800,1484]
[null,null,null,"2018-01-15",1492,1501,1492,1499,6400,1499]
[null,null,null,"2018-01-16",1509,1518,1505,1511,7300,1511]
[null,null,null,"2018-01-17",1500,1521,1500,1515,12400,1515]
[null,null,null,"2018-01-18",1527,1537,1513,1513,13000,1513]
[null,null,null,"2018-01-19",1517,1520,1503,1507,5000,1507]
[null,null,null,"2018-01-22",1510,1522,1510,1520,11100,1520]
[null,null,null,"2018-01-23",1523,1528,1521,1521,4600,1521]
[null,null,null,"2018-01-24",1521,1537,1521,1527,10000,1527]
[null,null,null,"2018-01-25",1532,1532,1516,1516,9900,1516]
[null,null,null,"2018-01-26",1516,1528,1516,1521,9700,1521]
[null,null,null,"2018-01-29",1524,1534,1500,1502,7800,1502]
{"$rows_left_out":43}
{"sheet":"7846","index":10,"n_rows":62,"n_cols":10,"rows_kept":62,"cut":false,"hidden":false,"merged":[]}
["証券コード","会社名"]
[7846,"パイロットコーポレーション"]
["市場","市場第一部（内国株）",null,"日付","始値","高値","安値","終値","出来高","調整後終値*"]
["相続日","2018-03-22",null,"2018-01-04",5520,5530,5430,5490,65700,5490]
["相続日の終値",5980,null,"2018-01-05",5520,5590,5500,5590,67200,5590]
["相続当月の終値の平均",5829.5238095238092,null,"2018-01-09",5590,5690,5560,5680,74000,5680]
["相続前月の終値の平均",5378.9473684210525,null,"2018-01-10",5700,5700,5580,5600,69100,5600]
["相続前々月の終値の平均",5581.0526315789475,null,"2018-01-11",5610,5610,5520,5550,42800,5550]
["４つのうちの最低額",{"$f":"ROUNDDOWN(MIN(B5:B8),0)","v":5378},null,"2018-01-12",5550,5570,5520,5520,43000,5520]
[null,null,null,"2018-01-15",5570,5600,5540,5550,20000,5550]
[null,null,null,"2018-01-16",5540,5630,5540,5600,36300,5600]
[null,null,null,"2018-01-17",5550,5610,5550,5590,34100,5590]
[null,null,null,"2018-01-18",5650,5670,5580,5580,61800,5580]
[null,null,null,"2018-01-19",5590,5630,5540,5570,36200,5570]
[null,null,null,"2018-01-22",5560,5580,5530,5570,28700,5570]
[null,null,null,"2018-01-23",5570,5670,5570,5660,32400,5660]
[null,null,null,"2018-01-24",5650,5720,5650,5660,33100,5660]
[null,null,null,"2018-01-25",5620,5650,5600,5630,26800,5630]
[null,null,null,"2018-01-26",5680,5680,5610,5630,24600,5630]
[null,null,null,"2018-01-29",5620,5640,5580,5590,25500,5590]
{"$rows_left_out":43}
{"sheet":"7832","index":11,"n_rows":62,"n_cols":10,"rows_kept":62,"cut":false,"hidden":false,"merged":[]}
["証券コード","会社名"]
[7832,"バンダイナムコホールディングス"]
["市場","市場第一部（内国株）",null,"日付","始値","高値","安値","終値","出来高","調整後終値*"]
["相続日","2018-03-22",null,"2018-01-04",3800,3850,3755,3815,1066400,3815]
["相続日の終値",3520,null,"2018-01-05",3850,3875,3800,3845,720500,3845]
["相続当月の終値の平均",3464.7619047619046,null,"2018-01-09",3860,3860,3785,3830,837100,3830]
["相続前月の終値の平均",3478.1578947368421,null,"2018-01-10",3850,3895,3800,3830,597900,3830]
["相続前々月の終値の平均",3710,null,"2018-01-11",3810,3830,3770,3820,814200,3820]
["４つのうちの最低額",{"$f":"ROUNDDOWN(MIN(B5:B8),0)","v":3464},null,"2018-01-12",3810,3835,3755,3765,793800,3765]
[null,null,null,"2018-01-15",3780,3795,3730,3735,518400,3735]
[null,null,null,"2018-01-16",3755,3770,3730,3745,557400,3745]
[null,null,null,"2018-01-17",3730,3760,3710,3710,695100,3710]
[null,null,null,"2018-01-18",3745,3775,3705,3705,732000,3705]
[null,null,null,"2018-01-19",3720,3745,3690,3705,456000,3705]
[null,null,null,"2018-01-22",3710,3720,3670,3690,461100,3690]
[null,null,null,"2018-01-23",3690,3700,3630,3645,1194600,3645]
[null,null,null,"2018-01-24",3640,3715,3635,3670,1624900,3670]
[null,null,null,"2018-01-25",3670,3680,3645,3650,572900,3650]
[null,null,null,"2018-01-26",3665,3675,3630,3635,700100,3635]
[null,null,null,"2018-01-29",3650,3655,3605,3610,1131300,3610]
{"$rows_left_out":43}
{"sheet":"7762","index":12,"n_rows":62,"n_cols":10,"rows_kept":62,"cut":false,"hidden":false,"merged":[]}
["証券コード","会社名"]
[7762,"シチズンホールディングス"]
["市場","市場第一部（内国株）",null,"日付","始値","高値","安値","終値","出来高","調整後終値*"]
["相続日","2018-03-22",null,"2018-01-04",838,844,833,843,1428400,843]
["相続日の終値",780,null,"2018-01-05",853,862,852,859,1245600,859]
["相続当月の終値の平均",769,null,"2018-01-09",864,875,860,864,1311100,864]
["相続前月の終値の平均",813.52631578947364,null,"2018-01-10",862,868,860,864,1169800,864]
["相続前々月の終値の平均",860.42105263157896,null,"2018-01-11",864,886,864,881,2237900,881]
["４つのうちの最低額",{"$f":"ROUNDDOWN(MIN(B5:B8),0)","v":769},null,"2018-01-12",882,889,869,870,1826900,870]
[null,null,null,"2018-01-15",870,877,866,868,845300,868]
[null,null,null,"2018-01-16",867,870,860,865,903000,865]
[null,null,null,"2018-01-17",858,859,848,849,1430900,849]
[null,null,null,"2018-01-18",858,866,849,852,1715300,852]
[null,null,null,"2018-01-19",857,864,854,863,1316300,863]
[null,null,null,"2018-01-22",861,864,850,853,972300,853]
[null,null,null,"2018-01-23",856,875,856,873,1612700,873]
[null,null,null,"2018-01-24",878,880,874,877,1611500,877]
[null,null,null,"2018-01-25",877,877,859,863,1302300,863]
[null,null,null,"2018-01-26",870,875,860,864,1479400,864]
[null,null,null,"2018-01-29",861,870,856,861,1100500,861]
{"$rows_left_out":43}
{"sheet":"7732","index":13,"n_rows":62,"n_cols":10,"rows_kept":62,"cut":false,"hidden":false,"merged":[]}
["証券コード","会社名"]
[7732,"トプコン"]
["市場","市場第一部（内国株）",null,"日付","始値","高値","安値","終値","出来高","調整後終値*"]
["相続日","2018-03-22",null,"2018-01-04",2483,2525,2472,2521,509100,2521]
["相続日の終値",2164,null,"2018-01-05",2548,2566,2518,2566,453400,2566]
["相続当月の終値の平均",2202.3809523809523,null,"2018-01-09",2553,2571,2526,2566,454500,2566]
["相続前月の終値の平均",2432.7368421052633,null,"2018-01-10",2561,2573,2553,2561,279400,2561]
["相続前々月の終値の平均",2656.9473684210525,null,"2018-01-11",2546,2573,2526,2573,310200,2573]
["４つのうちの最低額",{"$f":"ROUNDDOWN(MIN(B5:B8),0)","v":2164},null,"2018-01-12",2563,2599,2555,2591,353400,2591]
[null,null,null,"2018-01-15",2632,2633,2596,2598,287400,2598]
[null,null,null,"2018-01-16",2596,2659,2591,2657,402000,2657]
[null,null,null,"2018-01-17",2630,2699,2613,2692,473500,2692]
[null,null,null,"2018-01-18",2718,2724,2606,2612,502200,2612]
[null,null,null,"2018-01-19",2630,2639,2575,2604,490900,2604]
[null,null,null,"2018-01-22",2607,2644,2583,2644,294800,2644]
[null,null,null,"2018-01-23",2656,2695,2646,2693,292200,2693]
[null,null,null,"2018-01-24",2681,2698,2655,2657,367900,2657]
[null,null,null,"2018-01-25",2628,2704,2613,2685,623000,2685]
[null,null,null,"2018-01-26",2735,2917,2735,2842,1354400,2842]
[null,null,null,"2018-01-29",2824,2837,2802,2823,352700,2823]
{"$rows_left_out":43}
{"sheet":"7596","index":14,"n_rows":62,"n_cols":10,"rows_kept":62,"cut":false,"hidden":false,"merged":[]}
["証券コード","会社名"]
[7596,"魚力"]
["市場","市場第一部（内国株）",null,"日付","始値","高値","安値","終値","出来高","調整後終値*"]
["相続日","2018-03-22",null,"2018-01-04",1181,1199,1181,1199,30000,1199]
["相続日の終値",1363,null,"2018-01-05",1200,1203,1195,1199,13700,1199]
["相続当月の終値の平均",1258.2857142857142,null,"2018-01-09",1200,1205,1200,1203,17200,1203]
["相続前月の終値の平均",1189.1578947368421,null,"2018-01-10",1203,1230,1202,1229,23500,1229]
["相続前々月の終値の平均",1215.3684210526317,null,"2018-01-11",1219,1225,1214,1223,15300,1223]
["４つのうちの最低額",{"$f":"ROUNDDOWN(MIN(B5:B8),0)","v":1189},null,"2018-01-12",1223,1244,1223,1240,23800,1240]
[null,null,null,"2018-01-15",1247,1250,1236,1247,14400,1247]
[null,null,null,"2018-01-16",1240,1251,1237,1238,15100,1238]
[null,null,null,"2018-01-17",1240,1240,1226,1229,13300,1229]
[null,null,null,"2018-01-18",1239,1240,1215,1218,11600,1218]
[null,null,null,"2018-01-19",1221,1221,1209,1210,8000,1210]
[null,null,null,"2018-01-22",1211,1213,1204,1208,8100,1208]
[null,null,null,"2018-01-23",1208,1216,1207,1210,4600,1210]
[null,null,null,"2018-01-24",1212,1220,1208,1210,11600,1210]
[null,null,null,"2018-01-25",1210,1214,1208,1209,5500,1209]
[null,null,null,"2018-01-26",1212,1223,1212,1218,12200,1218]
[null,null,null,"2018-01-29",1220,1220,1205,1207,6600,1207]
{"$rows_left_out":43}
{"sheet":"証券コード一覧","index":15,"n_rows":3805,"n_cols":3,"rows_kept":3805,"cut":false,"hidden":false,"merged":[]}
["証券コード一覧表"]
[]
[]
[]
["証券コード","会社名","市場"]
[1301,"極洋","市場第一部（内国株）"]
[1305,"ダイワ上場投信－トピックス","ETF・ETN"]
[1306,"ＴＯＰＩＸ連動型上場投資信託","ETF・ETN"]
[1308,"上場インデックスファンドＴＯＰＩＸ","ETF・ETN"]
[1309,"上海株式指数・上証５０連動型上場投資信託","ETF・ETN"]
[1310,"ダイワ上場投信－トピックス・コア３０","ETF・ETN"]
[1311,"ＴＯＰＩＸ　Ｃｏｒｅ　３０　連動型上場投資信託","ETF・ETN"]
[1312,"ラッセル野村小型コア・インデックス連動型上場投資信託","ETF・ETN"]
[1313,"サムスンＫＯＤＥＸ２００証券上場指数投資信託［株式］","ETF・ETN"]
[1314,"上場インデックスファンドＳ＆Ｐ日本新興株１００","ETF・ETN"]
[1319,"日経３００株価指数連動型上場投資信託","ETF・ETN"]
[1320,"ダイワ上場投信－日経２２５","ETF・ETN"]
[1321,"日経２２５連動型上場投資信託","ETF・ETN"]
[1322,"上場インデックスファンド中国Ａ株（パンダ）ＣＳＩ３００","ETF・ETN"]
[1323,"ＮＥＸＴ　ＦＵＮＤＳ　南アフリカ株式指数・ＦＴＳＥ／ＪＳＥ　Ａｆｒｉｃａ　Ｔｏｐ４０連動型上場投信","ETF・ETN"]
{"$rows_left_out":3785}