{"text_format":"1","workbook":"xlsx","n_sheets":2,"sheets":["Fax送付案内","送付先リスト"],"not_rendered":{"charts":0,"images":0,"macros":1,"external_links":0,"defined_names":1,"comments":0,"pivot_tables":0},"unopened":[],"bounds":{"document_bytes":16777216,"sheet_cells":100000,"rows_first":2000,"rows_last":500,"rows_between":2000,"halvings":0,"cell_chars":16384,"cell_head_chars":4096},"cells_cut":0,"cells_raw":0,"read":"whole","date_system":"1900"}

{"sheet":"Fax送付案内","index":0,"n_rows":48,"n_cols":9,"rows_kept":48,"cut":false,"hidden":false,"merged":[[29,0,29,8],[1,1,1,2],[1,3,1,5],[1,6,1,7],[0,1,0,7],[19,0,19,8],[23,0,23,3],[24,0,24,8],[9,6,9,7]]}
["番号","宛先"]
[1,{"$f":"VLOOKUP(A2,送付先リスト!A:D,2,FALSE)","v":"０７８－１２３－４５６７"},null,{"$f":"VLOOKUP(A2,送付先リスト!A:D,3,FALSE)","v":"株式会社金沢金属"},null,null,{"$f":"VLOOKUP(A2,送付先リスト!A:D,4,FALSE)","v":"購買部　今津様"}]
[]
[]
[]
["Fax No.",{"$f":"B2","v":"０７８－１２３－４５６７"}]
[{"$f":"D2","v":"株式会社金沢金属"}]
[{"$f":"G2","v":"購買部　今津様"}]
[]
[null,null,null,null,null,null,{"$f":"TODAY()","v":"2014-05-14"}]
[null,null,null,null,null,null,"小林敬幸税理士事務所"]
[null,null,null,null,null,null,"〒658-0047"]
[null,null,null,null,null,null,"神戸市東灘区御影１丁目８番３１"]
[null,null,null,null,null,null,"上御影ハイツ205号"]
[null,null,null,null,null,null,"Tel. 078-766-0801"]
[null,null,null,null,null,null,"Fax. 078-766-7386"]
[null,null,null,null,null,null,"担当：小林"]
[null,null,null,null,null,null,"e-mail:kobatax@kcc.zaq.ne.jp"]
[]
["FAX送付のご案内"]
[]
[]
[]
["いつもお世話になっております。"]
["下記の件につきましてＦａｘにてご連絡させていただきますので、よろしくお願いいたします。"]
[]
[]
[]
[]
["記"]
["お電話いただいた件につき、別紙のとおり明細をお送りしますので、ご査収ください。"]
[]
[]
[]
[]
[]
[]
[]
[]
[]
[]
[]
[]
[]
[]
[]
[null,"よろしくお願いいたします。",null,null,null,null,null,"（全２枚）"]
[null,null,null,null,null,null,null,null,"以上"]

{"sheet":"送付先リスト","index":1,"n_rows":43,"n_cols":4,"rows_kept":43,"cut":false,"hidden":false,"merged":[]}
["FAX送付先リスト"]
[]
["ＮＯ．","ＦＡＸ番号","宛先１","宛先２"]
[1,"０７８－１２３－４５６７","株式会社金沢金属","購買部　今津様"]
[2,"０７５－９８７－６５４３","株式会社岡部工務店","経理課　常盤様"]
[3,"０６－５４３２－９８７６","芳賀商事株式会社","理財部　山下様"]
[4]
[5]
[6]
[7]
[8]
[9]
[10]
[11]
[12]
[13]
[14]
[15]
[16]
[17]
[18]
[19]
[20]
[21]
[22]
[23]
[24]
[25]
[26]
[27]
[28]
[29]
[30]
[31]
[32]
[33]
[34]
[35]
[36]
[37]
[38]
[39]
[40]