{"text_format":"1","workbook":"xlsx","n_sheets":7,"sheets":["ＴＯＰ","基本情報","従業員情報","給与入力","別表６（２０）","別表６（２１）","計算基礎シート"],"not_rendered":{"charts":0,"images":10,"macros":1,"external_links":0,"defined_names":2,"comments":1,"pivot_tables":0},"unopened":[],"bounds":{"document_bytes":16777216,"sheet_cells":100000,"rows_first":2000,"rows_last":500,"rows_between":2000,"halvings":0,"cell_chars":16384,"cell_head_chars":4096},"cells_cut":0,"cells_raw":0,"read":"whole","date_system":"1900"}

{"sheet":"ＴＯＰ","index":0,"n_rows":28,"n_cols":6,"rows_kept":28,"cut":false,"hidden":false,"merged":[[0,0,0,5],[27,2,28,5],[30,2,31,5],[21,2,23,5],[24,2,26,5]]}
[]
[]
[]
[null,"入力・移動　　各シートの",null,null,"に必要事項を入力します。"]
[null,"印刷　　　　　各シートはＡ４サイズの用紙に出力されます。"]
[]
[null,"入力・移動",null,"印刷",null,"説明"]
[]
[null,null,null,null,null,"会社名、中小企業者等の別、適用事業年度などを入力します"]
[]
{"$rows_left_out":19}
{"sheet":"基本情報","index":1,"n_rows":23,"n_cols":13,"rows_kept":23,"cut":false,"hidden":false,"merged":[[14,1,15,1],[22,1,23,1]]}
[]
[]
[]
[]
[]
[]
[null,"会社名","株式会社今野デザイン"]
[]
[null,"中小企業に該当するか","非該当",{"$f":"IF(C9=\"該当\",20,10)","v":10},null,null,null,null,null,null,null,"中小法人","大法人"]
[null,null,null,"期首日","2015-04-01","2016-04-01","2017-04-01","2018-04-01","月数","前事業年度月数",null,{"$f":"IF(D11<E10,0.02,0.03)","v":0.03},{"$f":"IF(D11<E10,0.02,IF(D11<F10,0.03,IF(D11<G10,0.04,0.05)))","v":0.03}]
{"$rows_left_out":14}
{"sheet":"従業員情報","index":2,"n_rows":38,"n_cols":14,"rows_kept":38,"cut":false,"hidden":false,"merged":[]}
[]
[]
[]
[]
[null,"No.","従業員名","役員・使用人兼務役員\n特殊関係者","国内雇用者","雇用保険\n一般被保険者","一般被保険者\nとなった月","一般被保険者\nでなくなった月","一般被保険者で\nなくなった理由","なった月\n判定","一般被保険者\nとなった月","一般被保険者\nでなくなった月","継続雇用者","なくなった月\n判定"]
[null,1,"今野　友夫","該当",null,null,null,null,null,{"$f":"IF(ISERROR(VLOOKUP(G6,計算基礎シート!I$5:J$28,2,FALSE)),2,VLOOKUP(G6,計算基礎シート!I$5:J$28,2,FALSE))","v":2},{"$f":"IF(ISERROR(VLOOKUP(G6,計算基礎シート!$C$5:$D$28,2,FALSE)),\"\",VLOOKUP(G6,計算基礎シート!$C$5:$D$28,2,FALSE))","v":""},{"$f":"IF(ISERROR(VLOOKUP(H6,計算基礎シート!$F$3:$G$28,2,FALSE)),\"\",VLOOKUP(H6,計算基礎シート!$F$3:$G$28,2,FALSE))","v":""},{"$f":"IF(AND(J6=1,N6=1),\"該当\",\"\")","v":""},{"$f":"IF(ISERROR(VLOOKUP(L6,計算基礎シート!G$5:H$28,2,FALSE)),2,VLOOKUP(L6,計算基礎シート!G$5:H$28,2,FALSE))","v":2}]
[null,2,"今野　朝子","該当",null,null,null,null,null,{"$f":"IF(ISERROR(VLOOKUP(G7,計算基礎シート!I$5:J$28,2,FALSE)),2,VLOOKUP(G7,計算基礎シート!I$5:J$28,2,FALSE))","v":2},{"$f":"IF(ISERROR(VLOOKUP(G7,計算基礎シート!$C$5:$D$28,2,FALSE)),\"\",VLOOKUP(G7,計算基礎シート!$C$5:$D$28,2,FALSE))","v":""},{"$f":"IF(ISERROR(VLOOKUP(H7,計算基礎シート!$F$3:$G$28,2,FALSE)),\"\",VLOOKUP(H7,計算基礎シート!$F$3:$G$28,2,FALSE))","v":""},{"$f":"IF(AND(J7=1,N7=1),\"該当\",\"\")","v":""},{"$f":"IF(ISERROR(VLOOKUP(L7,計算基礎シート!G$5:H$28,2,FALSE)),2,VLOOKUP(L7,計算基礎シート!G$5:H$28,2,FALSE))","v":2}]
[null,3,"今野　祥子","該当",null,null,null,null,null,{"$f":"IF(ISERROR(VLOOKUP(G8,計算基礎シート!I$5:J$28,2,FALSE)),2,VLOOKUP(G8,計算基礎シート!I$5:J$28,2,FALSE))","v":2},{"$f":"IF(ISERROR(VLOOKUP(G8,計算基礎シート!$C$5:$D$28,2,FALSE)),\"\",VLOOKUP(G8,計算基礎シート!$C$5:$D$28,2,FALSE))","v":""},{"$f":"IF(ISERROR(VLOOKUP(H8,計算基礎シート!$F$3:$G$28,2,FALSE)),\"\",VLOOKUP(H8,計算基礎シート!$F$3:$G$28,2,FALSE))","v":""},"",{"$f":"IF(ISERROR(VLOOKUP(L8,計算基礎シート!G$5:H$28,2,FALSE)),2,VLOOKUP(L8,計算基礎シート!G$5:H$28,2,FALSE))","v":2}]
[null,4,"川西　めぐみ","非該当","該当","該当","2014年10月以前","在職中",null,{"$f":"IF(ISERROR(VLOOKUP(G9,計算基礎シート!I$5:J$28,2,FALSE)),2,VLOOKUP(G9,計算基礎シート!I$5:J$28,2,FALSE))","v":1},{"$f":"IF(ISERROR(VLOOKUP(G9,計算基礎シート!$C$5:$D$28,2,FALSE)),\"\",VLOOKUP(G9,計算基礎シート!$C$5:$D$28,2,FALSE))","v":"2014-10-01"},{"$f":"IF(ISERROR(VLOOKUP(H9,計算基礎シート!$F$3:$G$28,2,FALSE)),\"\",VLOOKUP(H9,計算基礎シート!$F$3:$G$28,2,FALSE))","v":"2016-09-30"},"該当",{"$f":"IF(ISERROR(VLOOKUP(L9,計算基礎シート!G$5:H$28,2,FALSE)),2,VLOOKUP(L9,計算基礎シート!G$5:H$28,2,FALSE))","v":1}]
[null,5,"鳥居　雅之","非該当","該当","非該当",null,null,null,{"$f":"IF(ISERROR(VLOOKUP(G10,計算基礎シート!I$5:J$28,2,FALSE)),2,VLOOKUP(G10,計算基礎シート!I$5:J$28,2,FALSE))","v":2},{"$f":"IF(ISERROR(VLOOKUP(G10,計算基礎シート!$C$5:$D$28,2,FALSE)),\"\",VLOOKUP(G10,計算基礎シート!$C$5:$D$28,2,FALSE))","v":""},{"$f":"IF(ISERROR(VLOOKUP(H10,計算基礎シート!$F$3:$G$28,2,FALSE)),\"\",VLOOKUP(H10,計算基礎シート!$F$3:$G$28,2,FALSE))","v":""},"",{"$f":"IF(ISERROR(VLOOKUP(L10,計算基礎シート!G$5:H$28,2,FALSE)),2,VLOOKUP(L10,計算基礎シート!G$5:H$28,2,FALSE))","v":2}]
{"$rows_left_out":29}
{"sheet":"給与入力","index":3,"n_rows":80,"n_cols":34,"rows_kept":80,"cut":false,"hidden":false,"merged":[[5,32,6,32],[25,32,32,32],[54,32,61,32]]}
[]
[]
[]
[null,"１、基準雇用者給与等支給額の入力"]
[null,"Ｎｏ．",1,2,3,4,5,6,7,8,9,10,11,12,13,14,15,16,17,18,19,20,21,22,23,24,25,26,27,28,29,30,"合計"]
[null,"名前",{"$f":"VLOOKUP(C5,従業員情報!$B$6:$C$35,2,FALSE)","v":"今野　友夫"},{"$f":"VLOOKUP(D5,従業員情報!$B$6:$C$35,2,FALSE)","v":"今野　朝子"},{"$f":"VLOOKUP(E5,従業員情報!$B$6:$C$35,2,FALSE)","v":"今野　祥子"},{"$f":"VLOOKUP(F5,従業員情報!$B$6:$C$35,2,FALSE)","v":"川西　めぐみ"},{"$f":"VLOOKUP(G5,従業員情報!$B$6:$C$35,2,FALSE)","v":"鳥居　雅之"},{"$f":"VLOOKUP(H5,従業員情報!$B$6:$C$35,2,FALSE)","v":"絹延橋　みつ子"},{"$f":"VLOOKUP(I5,従業員情報!$B$6:$C$35,2,FALSE)","v":"笹部　菜穂美"},{"$f":"VLOOKUP(J5,従業員情報!$B$6:$C$35,2,FALSE)","v":"山下　典子"},{"$f":"VLOOKUP(K5,従業員情報!$B$6:$C$35,2,FALSE)","v":"畦野　保則"},{"$f":"VLOOKUP(L5,従業員情報!$B$6:$C$35,2,FALSE)","v":"滝山　隆一"},{"$f":"VLOOKUP(M5,従業員情報!$B$6:$C$35,2,FALSE)","v":0},{"$f":"VLOOKUP(N5,従業員情報!$B$6:$C$35,2,FALSE)","v":0},{"$f":"VLOOKUP(O5,従業員情報!$B$6:$C$35,2,FALSE)","v":0},{"$f":"VLOOKUP(P5,従業員情報!$B$6:$C$35,2,FALSE)","v":0},{"$f":"VLOOKUP(Q5,従業員情報!$B$6:$C$35,2,FALSE)","v":0},{"$f":"VLOOKUP(R5,従業員情報!$B$6:$C$35,2,FALSE)","v":0},{"$f":"VLOOKUP(S5,従業員情報!$B$6:$C$35,2,FALSE)","v":0},{"$f":"VLOOKUP(T5,従業員情報!$B$6:$C$35,2,FALSE)","v":0},{"$f":"VLOOKUP(U5,従業員情報!$B$6:$C$35,2,FALSE)","v":0},{"$f":"VLOOKUP(V5,従業員情報!$B$6:$C$35,2,FALSE)","v":0},{"$f":"VLOOKUP(W5,従業員情報!$B$6:$C$35,2,FALSE)","v":0},{"$f":"VLOOKUP(X5,従業員情報!$B$6:$C$35,2,FALSE)","v":0},{"$f":"VLOOKUP(Y5,従業員情報!$B$6:$C$35,2,FALSE)","v":0},{"$f":"VLOOKUP(Z5,従業員情報!$B$6:$C$35,2,FALSE)","v":0},{"$f":"VLOOKUP(AA5,従業員情報!$B$6:$C$35,2,FALSE)","v":0},{"$f":"VLOOKUP(AB5,従業員情報!$B$6:$C$35,2,FALSE)","v":0},{"$f":"VLOOKUP(AC5,従業員情報!$B$6:$C$35,2,FALSE)","v":0},{"$f":"VLOOKUP(AD5,従業員情報!$B$6:$C$35,2,FALSE)","v":0},{"$f":"VLOOKUP(AE5,従業員情報!$B$6:$C$35,2,FALSE)","v":0},{"$f":"VLOOKUP(AF5,従業員情報!$B$6:$C$35,2,FALSE)","v":0},{"$f":"SUM(C7:AF7)","v":0}]
[null,"国内雇用者",{"$f":"IF(ISERROR(VLOOKUP(C5,従業員情報!$B$6:$H$35,4,FALSE)),\"\",VLOOKUP(C5,従業員情報!$B$6:$H$35,4,FALSE))","v":0},{"$f":"IF(ISERROR(VLOOKUP(D5,従業員情報!$B$6:$H$35,4,FALSE)),\"\",VLOOKUP(D5,従業員情報!$B$6:$H$35,4,FALSE))","v":0},{"$f":"IF(ISERROR(VLOOKUP(E5,従業員情報!$B$6:$H$35,4,FALSE)),\"\",VLOOKUP(E5,従業員情報!$B$6:$H$35,4,FALSE))","v":0},{"$f":"IF(ISERROR(VLOOKUP(F5,従業員情報!$B$6:$H$35,4,FALSE)),\"\",VLOOKUP(F5,従業員情報!$B$6:$H$35,4,FALSE))","v":"該当"},{"$f":"IF(ISERROR(VLOOKUP(G5,従業員情報!$B$6:$H$35,4,FALSE)),\"\",VLOOKUP(G5,従業員情報!$B$6:$H$35,4,FALSE))","v":"該当"},{"$f":"IF(ISERROR(VLOOKUP(H5,従業員情報!$B$6:$H$35,4,FALSE)),\"\",VLOOKUP(H5,従業員情報!$B$6:$H$35,4,FALSE))","v":"該当"},{"$f":"IF(ISERROR(VLOOKUP(I5,従業員情報!$B$6:$H$35,4,FALSE)),\"\",VLOOKUP(I5,従業員情報!$B$6:$H$35,4,FALSE))","v":"該当"},{"$f":"IF(ISERROR(VLOOKUP(J5,従業員情報!$B$6:$H$35,4,FALSE)),\"\",VLOOKUP(J5,従業員情報!$B$6:$H$35,4,FALSE))","v":"該当"},{"$f":"IF(ISERROR(VLOOKUP(K5,従業員情報!$B$6:$H$35,4,FALSE)),\"\",VLOOKUP(K5,従業員情報!$B$6:$H$35,4,FALSE))","v":"該当"},{"$f":"IF(ISERROR(VLOOKUP(L5,従業員情報!$B$6:$H$35,4,FALSE)),\"\",VLOOKUP(L5,従業員情報!$B$6:$H$35,4,FALSE))","v":"該当"},{"$f":"IF(ISERROR(VLOOKUP(M5,従業員情報!$B$6:$H$35,4,FALSE)),\"\",VLOOKUP(M5,従業員情報!$B$6:$H$35,4,FALSE))","v":0},{"$f":"IF(ISERROR(VLOOKUP(N5,従業員情報!$B$6:$H$35,4,FALSE)),\"\",VLOOKUP(N5,従業員情報!$B$6:$H$35,4,FALSE))","v":0},{"$f":"IF(ISERROR(VLOOKUP(O5,従業員情報!$B$6:$H$35,4,FALSE)),\"\",VLOOKUP(O5,従業員情報!$B$6:$H$35,4,FALSE))","v":0},{"$f":"IF(ISERROR(VLOOKUP(P5,従業員情報!$B$6:$H$35,4,FALSE)),\"\",VLOOKUP(P5,従業員情報!$B$6:$H$35,4,FALSE))","v":0},{"$f":"IF(ISERROR(VLOOKUP(Q5,従業員情報!$B$6:$H$35,4,FALSE)),\"\",VLOOKUP(Q5,従業員情報!$B$6:$H$35,4,FALSE))","v":0},{"$f":"IF(ISERROR(VLOOKUP(R5,従業員情報!$B$6:$H$35,4,FALSE)),\"\",VLOOKUP(R5,従業員情報!$B$6:$H$35,4,FALSE))","v":0},{"$f":"IF(ISERROR(VLOOKUP(S5,従業員情報!$B$6:$H$35,4,FALSE)),\"\",VLOOKUP(S5,従業員情報!$B$6:$H$35,4,FALSE))","v":0},{"$f":"IF(ISERROR(VLOOKUP(T5,従業員情報!$B$6:$H$35,4,FALSE)),\"\",VLOOKUP(T5,従業員情報!$B$6:$H$35,4,FALSE))","v":0},{"$f":"IF(ISERROR(VLOOKUP(U5,従業員情報!$B$6:$H$35,4,FALSE)),\"\",VLOOKUP(U5,従業員情報!$B$6:$H$35,4,FALSE))","v":0},{"$f":"IF(ISERROR(VLOOKUP(V5,従業員情報!$B$6:$H$35,4,FALSE)),\"\",VLOOKUP(V5,従業員情報!$B$6:$H$35,4,FALSE))","v":0},{"$f":"IF(ISERROR(VLOOKUP(W5,従業員情報!$B$6:$H$35,4,FALSE)),\"\",VLOOKUP(W5,従業員情報!$B$6:$H$35,4,FALSE))","v":0},{"$f":"IF(ISERROR(VLOOKUP(X5,従業員情報!$B$6:$H$35,4,FALSE)),\"\",VLOOKUP(X5,従業員情報!$B$6:$H$35,4,FALSE))","v":0},{"$f":"IF(ISERROR(VLOOKUP(Y5,従業員情報!$B$6:$H$35,4,FALSE)),\"\",VLOOKUP(Y5,従業員情報!$B$6:$H$35,4,FALSE))","v":0},{"$f":"IF(ISERROR(VLOOKUP(Z5,従業員情報!$B$6:$H$35,4,FALSE)),\"\",VLOOKUP(Z5,従業員情報!$B$6:$H$35,4,FALSE))","v":0},{"$f":"IF(ISERROR(VLOOKUP(AA5,従業員情報!$B$6:$H$35,4,FALSE)),\"\",VLOOKUP(AA5,従業員情報!$B$6:$H$35,4,FALSE))","v":0},{"$f":"IF(ISERROR(VLOOKUP(AB5,従業員情報!$B$6:$H$35,4,FALSE)),\"\",VLOOKUP(AB5,従業員情報!$B$6:$H$35,4,FALSE))","v":0},{"$f":"IF(ISERROR(VLOOKUP(AC5,従業員情報!$B$6:$H$35,4,FALSE)),\"\",VLOOKUP(AC5,従業員情報!$B$6:$H$35,4,FALSE))","v":0},{"$f":"IF(ISERROR(VLOOKUP(AD5,従業員情報!$B$6:$H$35,4,FALSE)),\"\",VLOOKUP(AD5,従業員情報!$B$6:$H$35,4,FALSE))","v":0},{"$f":"IF(ISERROR(VLOOKUP(AE5,従業員情報!$B$6:$H$35,4,FALSE)),\"\",VLOOKUP(AE5,従業員情報!$B$6:$H$35,4,FALSE))","v":0},{"$f":"IF(ISERROR(VLOOKUP(AF5,従業員情報!$B$6:$H$35,4,FALSE)),\"\",VLOOKUP(AF5,従業員情報!$B$6:$H$35,4,FALSE))","v":0}]
[null,{"$f":"基本情報!C15","v":"2012-10-01"},null,null,null,240000,30000,320500,null,null,185000,105000,null,null,null,null,null,null,null,null,null,null,null,null,null,null,null,null,null,null,null,null,{"$f":"SUM(C8:AF8)","v":880500}]
[null,{"$f":"EOMONTH(B8,1)","v":"2012-11-30"},null,null,null,232000,50000,310500,null,null,192000,123000,null,null,null,null,null,null,null,null,null,null,null,null,null,null,null,null,null,null,null,null,{"$f":"SUM(C9:AF9)","v":907500}]
[null,{"$f":"EOMONTH(B9,1)","v":"2012-12-31"},null,null,null,235000,40000,310200,null,null,178000,115000,null,null,null,null,null,null,null,null,null,null,null,null,null,null,null,null,null,null,null,null,878200]
{"$rows_left_out":71}
{"sheet":"別表６（２０）","index":4,"n_rows":75,"n_cols":46,"rows_kept":75,"cut":false,"hidden":true,"merged":[[21,4,21,13],[21,28,21,31],[22,4,22,13],[22,15,22,23],[22,28,22,31],[22,35,22,43],[24,2,25,14],[24,15,25,24],[24,25,24,34],[24,35,24,44],[25,25,25,34],[23,13,23,35],[25,35,25,44],[66,2,67,15],[66,16,67,16],[66,37,67,37],[26,4,26,12],[26,17,26,22],[26,27,26,32],[26,37,26,42],[27,28,27,31],[27,4,27,13],[61,24,62,31],[61,32,62,32],[59,33,60,38],[63,17,64,23],[62,4,63,15],[53,32,54,32],[57,7,57,9],[57,17,58,23],[57,24,58,31],[57,32,58,32],[57,33,58,38],[57,39,58,44],[58,7,58,9],[59,2,64,2],[59,3,64,3],[72,2,72,15],[72,16,73,16],[72,24,73,36],[72,37,73,37],[73,6,73,11],[65,3,65,22],[65,26,65,43],[70,3,70,14],[70,16,71,16],[70,17,71,23],[68,37,69,37],[68,38,69,44],[66,24,71,24],[70,37,71,37],[70,38,71,44],[66,25,67,36],[68,25,69,36],[70,25,70,36],[73,17,73,23],[66,38,67,44],[68,2,69,15],[68,16,69,16],[71,25,71,36],[71,2,71,15],[59,5,59,14],[59,24,59,31],[59,32,60,32],[63,24,63,31],[63,32,64,32],[64,7,64,12],[64,26,64,29],[60,4,61,15],[59,39,60,44],[60,17,61,23],[60,26,60,29],[47,3,55,3],[47,4,49,15],[47,25,47,43],[48,17,49,23],[48,24,52,32],[54,4,55,15],[54,17,55,23],[55,24,56,31],[55,32,56,32],[55,33,56,38],[55,39,56,44],[56,2,56,15],[47,2,55,2],[51,17,52,23],[52,8,52,11],[48,33,49,38],[48,39,49,44],[50,4,51,15],[50,33,51,38],[50,39,51,44],[52,33,52,38],[52,39,52,44],[53,4,53,15],[53,24,54,31],[43,2,43,15],[43,16,44,16],[44,4,44,13],[44,19,44,28],[44,33,44,42],[45,7,46,30],[45,37,46,38],[45,40,45,44],[46,40,46,44],[28,4,28,13],[41,2,42,15],[41,16,42,16],[42,19,42,28],[33,2,34,15],[33,16,34,16],[34,19,34,28],[34,33,34,42],[29,13,29,35],[28,15,28,23],[28,28,28,31],[28,35,28,43],[30,2,32,15],[30,16,30,30],[30,31,30,44],[31,16,31,30],[42,33,42,42],[35,2,36,15],[35,16,36,16],[36,19,36,28],[36,33,36,42],[37,2,38,15],[37,16,38,16],[38,19,38,28],[38,33,38,42],[31,31,31,44],[32,22,32,24],[32,36,32,38],[39,2,39,15],[39,16,40,16],[40,4,40,13],[40,19,40,28],[40,33,40,42],[1,45,6,45],[3,2,8,2],[3,3,8,3],[3,4,4,14],[3,15,4,15],[3,25,3,35],[3,36,5,36],[4,16,4,23],[4,24,15,24],[4,25,4,35],[4,37,4,44],[5,4,5,14],[5,15,6,15],[5,25,5,35],[6,8,6,9],[6,16,6,23],[6,25,6,35],[6,36,8,36],[7,4,7,14],[7,15,8,15],[7,45,22,45],[8,4,8,14],[8,16,8,23],[12,37,12,44],[1,2,2,22],[1,36,2,44],[7,25,8,35],[10,27,10,28],[10,29,10,33],[9,2,9,14],[9,15,10,15],[9,25,9,35],[9,36,10,36],[10,2,10,14],[10,16,10,23],[10,37,10,44],[1,23,2,25],[1,33,2,35],[1,26,1,32],[2,26,2,32],[7,37,8,44],[11,2,11,14],[11,15,12,15],[11,25,11,35],[11,36,12,36],[12,6,12,10],[12,16,12,23],[12,25,12,35],[13,2,13,14],[13,15,14,15],[13,25,13,35],[13,36,14,36],[14,6,14,10],[14,16,14,23],[14,25,14,35],[18,2,19,14],[18,15,19,24],[18,25,18,34],[18,35,18,44],[19,25,19,34],[19,35,19,44],[20,4,20,12],[14,37,14,44],[15,2,15,14],[15,15,16,15],[15,25,15,35],[15,36,16,36],[16,6,16,10],[16,16,16,23],[16,25,16,35],[16,37,16,44],[20,37,20,42],[20,27,20,32],[17,13,17,35],[20,17,20,22]]}
[]
[null,null,"雇用者給与等支給額が増加した場合の法人税額\nの特別控除に関する明細書",null,null,null,null,null,null,null,null,null,null,null,null,null,null,null,null,null,null,null,null,"事  業\n年  度",null,null,{"$f":"基本情報!D11","v":"2015-10-01"},null,null,null,null,null,null,"法人名",null,null,{"$f":"基本情報!C7","v":"株式会社今野デザイン"},null,null,null,null,null,null,null,null,"別表六二十"]
[null,null,null,null,null,null,null,null,null,null,null,null,null,null,null,null,null,null,null,null,null,null,null,null,null,null,{"$f":"基本情報!C11","v":"2016-09-30"}]
[null,null,"雇用者給与等","支給増加額の計算","雇用者給与等支給額",null,null,null,null,null,null,null,null,null,null,1,null,null,null,null,null,0,null,"円",null,"税 額 控 除 限 度 額",null,null,null,null,null,null,null,null,null,null,8,null,null,0,null,null,null,null,"円"]
[null,null,null,null,null,null,null,null,null,null,null,null,null,null,null,null,{"$f":"T35","v":9826300},null,null,null,null,null,null,null,"法 人 税 額 の 特 別 控 除 額 の 計 算",{"$f":"\"(3)×10/100\"","v":"(3)×10/100"},null,null,null,null,null,null,null,null,null,null,null,{"$f":"IF(Q5<Q13,0,IF(Q15<=Q17,0,IF(Q11<基本情報!E11,0,ROUNDDOWN(Q9*10/100,0))))","v":0}]
[null,null,null,null,"基準雇用者給与等支給額\n",null,null,null,null,null,null,null,null,null,null,2,null,null,null,null,null,0,null,null,null,"((1)<(5)の場合又は(6)≦(7)の場合は0)"]
[null,null,null,null,null,null,null,null,"(17)",null,null,null,null,null,null,null,{"$f":"IF(ISERROR(AJ23),0,AJ23)","v":12017550},null,null,null,null,null,null,null,null,"当期の所得に対する法人税の額",null,null,null,null,null,null,null,null,null,null,9,null,null,0]
[null,null,null,null,"雇用者給与等支給増加額\n",null,null,null,null,null,null,null,null,null,null,3,null,null,null,null,null,null,null,null,null,"(別表一(一)｢2｣、別表一(二)｢2｣又は別表一(三)｢2｣)",null,null,null,null,null,null,null,null,null,null,null,300000]
[null,null,null,null,"(1)－(2)\n(マイナスの場合は０)",null,null,null,null,null,null,null,null,null,null,null,{"$f":"IF(Q5-Q7<0,0,Q5-Q7)","v":0}]
[null,null,"雇用者給与等支給増加割合",null,null,null,null,null,null,null,null,null,null,null,null,4,null,null,null,null,null,null,null,null,null,"当期税額基準額",null,null,null,null,null,null,null,null,null,null,10]
{"$rows_left_out":66}
{"sheet":"別表６（２１）","index":5,"n_rows":65,"n_cols":28,"rows_kept":65,"cut":false,"hidden":false,"merged":[[1,1,2,10],[1,11,1,13],[1,14,1,18],[1,19,2,20],[1,21,2,25],[1,26,2,28],[2,11,2,13],[2,14,2,18],[3,28,7,28],[4,12,29,13],[4,16,5,16],[4,17,5,17],[6,14,7,21],[7,3,8,7],[7,8,10,8],[7,9,10,10],[8,14,9,21],[8,22,11,22],[3,14,3,21],[3,22,7,22],[3,23,7,24],[3,25,4,25],[3,26,7,26],[3,27,9,27],[8,23,11,24],[10,14,11,21],[3,3,6,7],[3,8,6,8],[3,9,6,10],[3,11,4,11],[9,3,10,7],[11,3,11,7],[12,3,12,7],[12,14,13,21],[12,22,17,22],[12,23,17,24],[13,3,14,7],[14,16,17,16],[14,17,17,17],[14,18,15,20],[15,1,16,7],[15,8,19,8],[3,1,14,1],[3,2,14,2],[11,8,14,8],[11,9,14,10],[15,9,19,11],[16,18,17,20],[17,5,18,5],[18,14,20,21],[18,22,22,22],[18,23,22,24],[20,1,21,7],[20,8,23,8],[20,9,23,10],[20,11,21,11],[27,14,28,21],[27,22,30,22],[27,23,30,24],[28,1,29,7],[28,8,30,8],[28,9,30,10],[29,14,30,21],[30,1,30,7],[21,14,22,21],[22,1,23,7],[23,14,24,21],[23,22,26,22],[23,23,26,24],[24,1,25,7],[24,8,27,8],[24,9,27,10],[25,14,26,21],[26,1,27,7],[31,1,31,25],[32,1,35,7],[32,8,33,13],[32,14,32,20],[32,21,33,25],[33,14,34,20],[34,8,35,13],[34,21,35,25],[35,14,35,20],[36,1,36,7],[36,8,36,13],[36,14,36,20],[36,21,36,25],[37,1,37,2],[37,8,38,12],[37,16,37,18],[37,21,38,24],[38,1,38,2],[38,16,38,18],[39,1,39,25],[40,1,43,7],[40,8,41,13],[40,14,40,20],[40,21,41,25],[41,14,42,20],[42,8,43,13],[42,21,43,25],[43,14,43,20],[44,1,44,7],[44,8,44,13],[44,14,44,20],[44,21,44,25],[45,1,45,2],[45,8,46,12],[45,16,45,18],[45,21,46,24],[46,1,46,2],[46,16,46,18],[51,8,52,8],[51,10,52,16],[51,20,52,24],[53,1,54,7],[53,8,54,8],[53,10,54,16],[53,20,54,24],[47,1,47,25],[48,1,50,8],[48,9,48,17],[48,18,48,25],[49,9,49,17],[49,18,49,25],[50,9,50,17],[50,18,50,25],[61,25,62,25],[37,3,37,7],[38,3,38,7],[45,3,45,7],[46,3,46,7],[59,1,60,7],[59,8,60,8],[59,10,60,16],[59,20,60,24],[61,1,61,7],[61,8,63,8],[61,10,63,16],[61,17,62,17],[61,20,63,24],[55,1,56,7],[55,8,56,8],[55,10,56,16],[55,20,56,24],[57,1,57,7],[57,8,58,8],[57,10,58,16],[57,20,58,24],[58,1,58,7],[51,1,52,7]]}
[]
[null,"雇用者給与等支給額が増加した場合の法人税額\nの特別控除に関する明細書",null,null,null,null,null,null,null,null,null,"事　業",null,null,{"$f":"'別表６（２０）'!$AA$2","v":"2015-10-01"},null,null,null,null,"法人名",null,{"$f":"'別表６（２０）'!AK2","v":"株式会社今野デザイン"},null,null,null,null,"別表六"]
[null,null,null,null,null,null,null,null,null,null,null,"年　度",null,null,{"$f":"'別表６（２０）'!AA3","v":"2016-09-30"}]
[null,"雇用者給与等","支給増加額の計算","雇用者給与等支給額",null,null,null,null,1,{"$f":"'別表６（２０）'!Q5","v":9826300},null,"円",null,null,"税額控除限度額",null,null,null,null,null,null,null,8,{"$f":"'別表６（２０）'!AL5","v":0},null,"円",null,"（二十一）"]
[null,null,null,null,null,null,null,null,null,null,null,null,"法人税額の特別控除額の計算",null,null,null,"(3)","×",10]
[null,null,null,null,null,null,null,null,null,null,null,null,null,null,null,null,null,null,100]
[null,null,null,null,null,null,null,null,null,null,null,null,null,null,"((1)＜(5)の場合又は(6)≦(7)の場合は０)"]
[null,null,null,"基準雇用者給与等支給額",null,null,null,null,2,{"$f":"'別表６（２０）'!Q7","v":12017550}]
[null,null,null,null,null,null,null,null,null,null,null,null,null,null,"調整前法人税額",null,null,null,null,null,null,null,9,300000]
[null,null,null,"(17)"]
{"$rows_left_out":56}
{"sheet":"計算基礎シート","index":6,"n_rows":28,"n_cols":12,"rows_kept":28,"cut":false,"hidden":true,"merged":[]}
[]
[]
[null,null,null,null,null,"在職中",{"$f":"G28","v":"2016-09-30"},"なくなった月",null,"なった月"]
[null,"前年度",null,null,"適用年度",{"$f":"F5&\"前退職\"","v":"2014年10月前退職"},{"$f":"G5-1","v":"2014-09-30"},1]
[1,{"$f":"基本情報!G11","v":"2014-10-01"},{"$f":"YEAR(B5)&\"年\"&MONTH(B5)&\"月以前\"","v":"2014年10月以前"},{"$f":"B5","v":"2014-10-01"},{"$f":"D5","v":"2014-10-01"},{"$f":"YEAR(E5)&\"年\"&MONTH(E5)&\"月\"","v":"2014年10月"},{"$f":"E5","v":"2014-10-01"},2,{"$f":"C5","v":"2014年10月以前"},1,null,"退職"]
[2,{"$f":"EOMONTH(B5,1)","v":"2014-11-30"},{"$f":"YEAR(B6)&\"年\"&MONTH(B6)&\"月\"","v":"2014年11月"},{"$f":"B6","v":"2014-11-30"},{"$f":"EOMONTH(E5,1)","v":"2014-11-30"},{"$f":"YEAR(E6)&\"年\"&MONTH(E6)&\"月\"","v":"2014年11月"},{"$f":"E6","v":"2014-11-30"},2,{"$f":"C6","v":"2014年11月"},1,null,"継続雇用制度に移行"]
[3,{"$f":"EOMONTH(B6,1)","v":"2014-12-31"},{"$f":"YEAR(B7)&\"年\"&MONTH(B7)&\"月\"","v":"2014年12月"},"2014-12-31",{"$f":"EOMONTH(E6,1)","v":"2014-12-31"},"2014年12月","2014-12-31",2,"2014年12月",1]
[4,"2015-01-31","2015年1月","2015-01-31","2015-01-31","2015年1月","2015-01-31",2,"2015年1月",1]
[5,"2015-02-28","2015年2月","2015-02-28","2015-02-28","2015年2月","2015-02-28",2,"2015年2月",1]
[6,"2015-03-31","2015年3月","2015-03-31","2015-03-31","2015年3月","2015-03-31",2,"2015年3月",1]
{"$rows_left_out":18}