{"text_format":"1","workbook":"xlsx","n_sheets":8,"sheets":["ＴＯＰ","基本情報","従業員情報","給与入力","別表６（２３）","別表６（２３）Ｈ３０","別表６（２３）付表１Ｈ３０","計算基礎シート"],"not_rendered":{"charts":0,"images":14,"macros":1,"external_links":0,"defined_names":3,"comments":1,"pivot_tables":0},"unopened":[],"bounds":{"document_bytes":16777216,"sheet_cells":100000,"rows_first":2000,"rows_last":500,"rows_between":2000,"halvings":0,"cell_chars":16384,"cell_head_chars":4096},"cells_cut":0,"cells_raw":0,"read":"whole","date_system":"1900"}

{"sheet":"ＴＯＰ","index":0,"n_rows":32,"n_cols":6,"rows_kept":32,"cut":false,"hidden":false,"merged":[[0,0,0,5],[31,2,32,5],[34,2,35,5],[25,2,27,5],[28,2,30,5]]}
[]
[]
[]
[null,"入力・移動　　各シートの",null,null,"に必要事項を入力します。"]
[null,"印刷　　　　　各シートはＡ４サイズの用紙に出力されます。"]
[]
[null,"入力・移動",null,"印刷",null,"説明"]
[]
[null,null,null,null,null,"会社名、中小企業者等の別、適用事業年度などを入力します"]
[]
{"$rows_left_out":23}
{"sheet":"基本情報","index":1,"n_rows":25,"n_cols":13,"rows_kept":25,"cut":false,"hidden":false,"merged":[[16,1,17,1],[24,1,25,1],[11,1,12,1]]}
[]
[]
[]
[]
[]
[]
[null,"会社名","株式会社今野デザイン"]
[]
[null,"中小企業に該当するか","該当",{"$f":"IF(C9=\"該当\",20,10)","v":20},null,null,null,null,null,null,null,"中小法人","大法人"]
[null,null,null,"期首日","2015-04-01","2016-04-01","2017-04-01","2018-04-01","月数","前事業年度月数",null,{"$f":"IF(D11<E10,0.02,0.03)","v":0.03},{"$f":"IF(D11<E10,0.02,IF(D11<F10,0.03,IF(D11<G10,0.04,0.05)))","v":0.05}]
{"$rows_left_out":16}
{"sheet":"従業員情報","index":2,"n_rows":38,"n_cols":14,"rows_kept":38,"cut":false,"hidden":false,"merged":[]}
[]
[]
[]
[]
[null,"No.","従業員名","役員・使用人兼務役員\n特殊関係者","国内雇用者","雇用保険\n一般被保険者","一般被保険者\nとなった月","一般被保険者\nでなくなった月","一般被保険者で\nなくなった理由","なった月\n判定","一般被保険者\nとなった月","一般被保険者\nでなくなった月","継続雇用者","なくなった月\n判定"]
[null,1,"今野　友夫","該当",null,null,null,null,null,{"$f":"IF(ISERROR(VLOOKUP(G6,計算基礎シート!I$5:J$28,2,FALSE)),2,VLOOKUP(G6,計算基礎シート!I$5:J$28,2,FALSE))","v":2},{"$f":"IF(ISERROR(VLOOKUP(G6,計算基礎シート!$C$5:$D$28,2,FALSE)),\"\",VLOOKUP(G6,計算基礎シート!$C$5:$D$28,2,FALSE))","v":""},{"$f":"IF(ISERROR(VLOOKUP(H6,計算基礎シート!$F$3:$G$28,2,FALSE)),\"\",VLOOKUP(H6,計算基礎シート!$F$3:$G$28,2,FALSE))","v":""},{"$f":"IF(AND(J6=1,N6=1),\"該当\",\"\")","v":""},{"$f":"IF(ISERROR(VLOOKUP(L6,計算基礎シート!G$5:H$28,2,FALSE)),2,VLOOKUP(L6,計算基礎シート!G$5:H$28,2,FALSE))","v":2}]
[null,2,"今野　朝子","該当",null,null,null,null,null,{"$f":"IF(ISERROR(VLOOKUP(G7,計算基礎シート!I$5:J$28,2,FALSE)),2,VLOOKUP(G7,計算基礎シート!I$5:J$28,2,FALSE))","v":2},{"$f":"IF(ISERROR(VLOOKUP(G7,計算基礎シート!$C$5:$D$28,2,FALSE)),\"\",VLOOKUP(G7,計算基礎シート!$C$5:$D$28,2,FALSE))","v":""},{"$f":"IF(ISERROR(VLOOKUP(H7,計算基礎シート!$F$3:$G$28,2,FALSE)),\"\",VLOOKUP(H7,計算基礎シート!$F$3:$G$28,2,FALSE))","v":""},{"$f":"IF(AND(J7=1,N7=1),\"該当\",\"\")","v":""},{"$f":"IF(ISERROR(VLOOKUP(L7,計算基礎シート!G$5:H$28,2,FALSE)),2,VLOOKUP(L7,計算基礎シート!G$5:H$28,2,FALSE))","v":2}]
[null,3,"今野　祥子","該当",null,null,null,null,null,{"$f":"IF(ISERROR(VLOOKUP(G8,計算基礎シート!I$5:J$28,2,FALSE)),2,VLOOKUP(G8,計算基礎シート!I$5:J$28,2,FALSE))","v":2},{"$f":"IF(ISERROR(VLOOKUP(G8,計算基礎シート!$C$5:$D$28,2,FALSE)),\"\",VLOOKUP(G8,計算基礎シート!$C$5:$D$28,2,FALSE))","v":""},{"$f":"IF(ISERROR(VLOOKUP(H8,計算基礎シート!$F$3:$G$28,2,FALSE)),\"\",VLOOKUP(H8,計算基礎シート!$F$3:$G$28,2,FALSE))","v":""},"",{"$f":"IF(ISERROR(VLOOKUP(L8,計算基礎シート!G$5:H$28,2,FALSE)),2,VLOOKUP(L8,計算基礎シート!G$5:H$28,2,FALSE))","v":2}]
[null,4,"川西　めぐみ","非該当","該当","該当","2016年10月以前","在職中",null,{"$f":"IF(ISERROR(VLOOKUP(G9,計算基礎シート!I$5:J$28,2,FALSE)),2,VLOOKUP(G9,計算基礎シート!I$5:J$28,2,FALSE))","v":1},{"$f":"IF(ISERROR(VLOOKUP(G9,計算基礎シート!$C$5:$D$28,2,FALSE)),\"\",VLOOKUP(G9,計算基礎シート!$C$5:$D$28,2,FALSE))","v":"2016-10-01"},{"$f":"IF(ISERROR(VLOOKUP(H9,計算基礎シート!$F$3:$G$28,2,FALSE)),\"\",VLOOKUP(H9,計算基礎シート!$F$3:$G$28,2,FALSE))","v":"2018-09-30"},"該当",{"$f":"IF(ISERROR(VLOOKUP(L9,計算基礎シート!G$5:H$28,2,FALSE)),2,VLOOKUP(L9,計算基礎シート!G$5:H$28,2,FALSE))","v":1}]
[null,5,"鳥居　雅之","非該当","該当","非該当",null,null,null,{"$f":"IF(ISERROR(VLOOKUP(G10,計算基礎シート!I$5:J$28,2,FALSE)),2,VLOOKUP(G10,計算基礎シート!I$5:J$28,2,FALSE))","v":2},{"$f":"IF(ISERROR(VLOOKUP(G10,計算基礎シート!$C$5:$D$28,2,FALSE)),\"\",VLOOKUP(G10,計算基礎シート!$C$5:$D$28,2,FALSE))","v":""},{"$f":"IF(ISERROR(VLOOKUP(H10,計算基礎シート!$F$3:$G$28,2,FALSE)),\"\",VLOOKUP(H10,計算基礎シート!$F$3:$G$28,2,FALSE))","v":""},"",{"$f":"IF(ISERROR(VLOOKUP(L10,計算基礎シート!G$5:H$28,2,FALSE)),2,VLOOKUP(L10,計算基礎シート!G$5:H$28,2,FALSE))","v":2}]
{"$rows_left_out":29}
{"sheet":"給与入力","index":3,"n_rows":80,"n_cols":34,"rows_kept":80,"cut":false,"hidden":false,"merged":[[5,32,6,32],[25,32,32,32],[54,32,61,32]]}
[]
[]
[]
[null,"１、基準雇用者給与等支給額の入力"]
[null,"Ｎｏ．",1,2,3,4,5,6,7,8,9,10,11,12,13,14,15,16,17,18,19,20,21,22,23,24,25,26,27,28,29,30,"合計"]
[null,"名前",{"$f":"VLOOKUP(C5,従業員情報!$B$6:$C$35,2,FALSE)","v":"今野　友夫"},{"$f":"VLOOKUP(D5,従業員情報!$B$6:$C$35,2,FALSE)","v":"今野　朝子"},{"$f":"VLOOKUP(E5,従業員情報!$B$6:$C$35,2,FALSE)","v":"今野　祥子"},{"$f":"VLOOKUP(F5,従業員情報!$B$6:$C$35,2,FALSE)","v":"川西　めぐみ"},{"$f":"VLOOKUP(G5,従業員情報!$B$6:$C$35,2,FALSE)","v":"鳥居　雅之"},{"$f":"VLOOKUP(H5,従業員情報!$B$6:$C$35,2,FALSE)","v":"絹延橋　みつ子"},{"$f":"VLOOKUP(I5,従業員情報!$B$6:$C$35,2,FALSE)","v":"笹部　菜穂美"},{"$f":"VLOOKUP(J5,従業員情報!$B$6:$C$35,2,FALSE)","v":"山下　典子"},{"$f":"VLOOKUP(K5,従業員情報!$B$6:$C$35,2,FALSE)","v":"畦野　保則"},{"$f":"VLOOKUP(L5,従業員情報!$B$6:$C$35,2,FALSE)","v":"滝山　隆一"},{"$f":"VLOOKUP(M5,従業員情報!$B$6:$C$35,2,FALSE)","v":0},{"$f":"VLOOKUP(N5,従業員情報!$B$6:$C$35,2,FALSE)","v":0},{"$f":"VLOOKUP(O5,従業員情報!$B$6:$C$35,2,FALSE)","v":0},{"$f":"VLOOKUP(P5,従業員情報!$B$6:$C$35,2,FALSE)","v":0},{"$f":"VLOOKUP(Q5,従業員情報!$B$6:$C$35,2,FALSE)","v":0},{"$f":"VLOOKUP(R5,従業員情報!$B$6:$C$35,2,FALSE)","v":0},{"$f":"VLOOKUP(S5,従業員情報!$B$6:$C$35,2,FALSE)","v":0},{"$f":"VLOOKUP(T5,従業員情報!$B$6:$C$35,2,FALSE)","v":0},{"$f":"VLOOKUP(U5,従業員情報!$B$6:$C$35,2,FALSE)","v":0},{"$f":"VLOOKUP(V5,従業員情報!$B$6:$C$35,2,FALSE)","v":0},{"$f":"VLOOKUP(W5,従業員情報!$B$6:$C$35,2,FALSE)","v":0},{"$f":"VLOOKUP(X5,従業員情報!$B$6:$C$35,2,FALSE)","v":0},{"$f":"VLOOKUP(Y5,従業員情報!$B$6:$C$35,2,FALSE)","v":0},{"$f":"VLOOKUP(Z5,従業員情報!$B$6:$C$35,2,FALSE)","v":0},{"$f":"VLOOKUP(AA5,従業員情報!$B$6:$C$35,2,FALSE)","v":0},{"$f":"VLOOKUP(AB5,従業員情報!$B$6:$C$35,2,FALSE)","v":0},{"$f":"VLOOKUP(AC5,従業員情報!$B$6:$C$35,2,FALSE)","v":0},{"$f":"VLOOKUP(AD5,従業員情報!$B$6:$C$35,2,FALSE)","v":0},{"$f":"VLOOKUP(AE5,従業員情報!$B$6:$C$35,2,FALSE)","v":0},{"$f":"VLOOKUP(AF5,従業員情報!$B$6:$C$35,2,FALSE)","v":0},{"$f":"SUM(C7:AF7)","v":0}]
[null,"国内雇用者",{"$f":"IF(ISERROR(VLOOKUP(C5,従業員情報!$B$6:$H$35,4,FALSE)),\"\",VLOOKUP(C5,従業員情報!$B$6:$H$35,4,FALSE))","v":0},{"$f":"IF(ISERROR(VLOOKUP(D5,従業員情報!$B$6:$H$35,4,FALSE)),\"\",VLOOKUP(D5,従業員情報!$B$6:$H$35,4,FALSE))","v":0},{"$f":"IF(ISERROR(VLOOKUP(E5,従業員情報!$B$6:$H$35,4,FALSE)),\"\",VLOOKUP(E5,従業員情報!$B$6:$H$35,4,FALSE))","v":0},{"$f":"IF(ISERROR(VLOOKUP(F5,従業員情報!$B$6:$H$35,4,FALSE)),\"\",VLOOKUP(F5,従業員情報!$B$6:$H$35,4,FALSE))","v":"該当"},{"$f":"IF(ISERROR(VLOOKUP(G5,従業員情報!$B$6:$H$35,4,FALSE)),\"\",VLOOKUP(G5,従業員情報!$B$6:$H$35,4,FALSE))","v":"該当"},{"$f":"IF(ISERROR(VLOOKUP(H5,従業員情報!$B$6:$H$35,4,FALSE)),\"\",VLOOKUP(H5,従業員情報!$B$6:$H$35,4,FALSE))","v":"該当"},{"$f":"IF(ISERROR(VLOOKUP(I5,従業員情報!$B$6:$H$35,4,FALSE)),\"\",VLOOKUP(I5,従業員情報!$B$6:$H$35,4,FALSE))","v":"該当"},{"$f":"IF(ISERROR(VLOOKUP(J5,従業員情報!$B$6:$H$35,4,FALSE)),\"\",VLOOKUP(J5,従業員情報!$B$6:$H$35,4,FALSE))","v":"該当"},{"$f":"IF(ISERROR(VLOOKUP(K5,従業員情報!$B$6:$H$35,4,FALSE)),\"\",VLOOKUP(K5,従業員情報!$B$6:$H$35,4,FALSE))","v":"該当"},{"$f":"IF(ISERROR(VLOOKUP(L5,従業員情報!$B$6:$H$35,4,FALSE)),\"\",VLOOKUP(L5,従業員情報!$B$6:$H$35,4,FALSE))","v":"該当"},{"$f":"IF(ISERROR(VLOOKUP(M5,従業員情報!$B$6:$H$35,4,FALSE)),\"\",VLOOKUP(M5,従業員情報!$B$6:$H$35,4,FALSE))","v":0},{"$f":"IF(ISERROR(VLOOKUP(N5,従業員情報!$B$6:$H$35,4,FALSE)),\"\",VLOOKUP(N5,従業員情報!$B$6:$H$35,4,FALSE))","v":0},{"$f":"IF(ISERROR(VLOOKUP(O5,従業員情報!$B$6:$H$35,4,FALSE)),\"\",VLOOKUP(O5,従業員情報!$B$6:$H$35,4,FALSE))","v":0},{"$f":"IF(ISERROR(VLOOKUP(P5,従業員情報!$B$6:$H$35,4,FALSE)),\"\",VLOOKUP(P5,従業員情報!$B$6:$H$35,4,FALSE))","v":0},{"$f":"IF(ISERROR(VLOOKUP(Q5,従業員情報!$B$6:$H$35,4,FALSE)),\"\",VLOOKUP(Q5,従業員情報!$B$6:$H$35,4,FALSE))","v":0},{"$f":"IF(ISERROR(VLOOKUP(R5,従業員情報!$B$6:$H$35,4,FALSE)),\"\",VLOOKUP(R5,従業員情報!$B$6:$H$35,4,FALSE))","v":0},{"$f":"IF(ISERROR(VLOOKUP(S5,従業員情報!$B$6:$H$35,4,FALSE)),\"\",VLOOKUP(S5,従業員情報!$B$6:$H$35,4,FALSE))","v":0},{"$f":"IF(ISERROR(VLOOKUP(T5,従業員情報!$B$6:$H$35,4,FALSE)),\"\",VLOOKUP(T5,従業員情報!$B$6:$H$35,4,FALSE))","v":0},{"$f":"IF(ISERROR(VLOOKUP(U5,従業員情報!$B$6:$H$35,4,FALSE)),\"\",VLOOKUP(U5,従業員情報!$B$6:$H$35,4,FALSE))","v":0},{"$f":"IF(ISERROR(VLOOKUP(V5,従業員情報!$B$6:$H$35,4,FALSE)),\"\",VLOOKUP(V5,従業員情報!$B$6:$H$35,4,FALSE))","v":0},{"$f":"IF(ISERROR(VLOOKUP(W5,従業員情報!$B$6:$H$35,4,FALSE)),\"\",VLOOKUP(W5,従業員情報!$B$6:$H$35,4,FALSE))","v":0},{"$f":"IF(ISERROR(VLOOKUP(X5,従業員情報!$B$6:$H$35,4,FALSE)),\"\",VLOOKUP(X5,従業員情報!$B$6:$H$35,4,FALSE))","v":0},{"$f":"IF(ISERROR(VLOOKUP(Y5,従業員情報!$B$6:$H$35,4,FALSE)),\"\",VLOOKUP(Y5,従業員情報!$B$6:$H$35,4,FALSE))","v":0},{"$f":"IF(ISERROR(VLOOKUP(Z5,従業員情報!$B$6:$H$35,4,FALSE)),\"\",VLOOKUP(Z5,従業員情報!$B$6:$H$35,4,FALSE))","v":0},{"$f":"IF(ISERROR(VLOOKUP(AA5,従業員情報!$B$6:$H$35,4,FALSE)),\"\",VLOOKUP(AA5,従業員情報!$B$6:$H$35,4,FALSE))","v":0},{"$f":"IF(ISERROR(VLOOKUP(AB5,従業員情報!$B$6:$H$35,4,FALSE)),\"\",VLOOKUP(AB5,従業員情報!$B$6:$H$35,4,FALSE))","v":0},{"$f":"IF(ISERROR(VLOOKUP(AC5,従業員情報!$B$6:$H$35,4,FALSE)),\"\",VLOOKUP(AC5,従業員情報!$B$6:$H$35,4,FALSE))","v":0},{"$f":"IF(ISERROR(VLOOKUP(AD5,従業員情報!$B$6:$H$35,4,FALSE)),\"\",VLOOKUP(AD5,従業員情報!$B$6:$H$35,4,FALSE))","v":0},{"$f":"IF(ISERROR(VLOOKUP(AE5,従業員情報!$B$6:$H$35,4,FALSE)),\"\",VLOOKUP(AE5,従業員情報!$B$6:$H$35,4,FALSE))","v":0},{"$f":"IF(ISERROR(VLOOKUP(AF5,従業員情報!$B$6:$H$35,4,FALSE)),\"\",VLOOKUP(AF5,従業員情報!$B$6:$H$35,4,FALSE))","v":0}]
[null,{"$f":"基本情報!C17","v":"2012-10-01"},null,null,null,240000,30000,320500,null,null,185000,105000,null,null,null,null,null,null,null,null,null,null,null,null,null,null,null,null,null,null,null,null,{"$f":"SUM(C8:AF8)","v":880500}]
[null,{"$f":"IF($B$8=\"-\",\"-\",EOMONTH(B8,1))","v":"2012-11-30"},null,null,null,232000,50000,310500,null,null,192000,123000,null,null,null,null,null,null,null,null,null,null,null,null,null,null,null,null,null,null,null,null,{"$f":"SUM(C9:AF9)","v":907500}]
[null,{"$f":"IF($B$8=\"-\",\"-\",EOMONTH(B9,1))","v":"2012-12-31"},null,null,null,235000,40000,310200,null,null,178000,115000,null,null,null,null,null,null,null,null,null,null,null,null,null,null,null,null,null,null,null,null,878200]
{"$rows_left_out":71}
{"sheet":"別表６（２３）","index":4,"n_rows":59,"n_cols":54,"rows_kept":59,"cut":false,"hidden":false,"merged":[[11,16,12,22],[14,16,16,22],[18,16,18,22],[20,16,20,22],[22,16,23,22],[25,16,25,22],[29,37,29,43],[22,37,23,43],[25,37,25,43],[11,37,12,43],[14,37,16,43],[18,37,18,43],[20,37,20,43],[56,2,56,15],[56,16,57,16],[57,4,57,13],[57,19,57,29],[57,33,57,43],[26,37,27,43],[29,16,29,22],[52,2,52,15],[52,16,53,16],[53,4,53,13],[53,19,53,29],[53,33,53,43],[54,2,55,15],[54,16,55,16],[55,19,55,29],[55,33,55,43],[48,2,49,15],[48,16,49,16],[49,19,49,29],[49,33,49,43],[50,2,51,15],[50,16,51,16],[51,19,51,29],[51,33,51,43],[46,2,47,15],[46,16,47,16],[46,17,46,18],[46,31,46,32],[47,19,47,29],[47,33,47,43],[43,2,45,15],[43,16,43,30],[43,31,43,44],[44,16,44,30],[44,31,44,44],[45,22,45,24],[45,36,45,38],[41,2,41,3],[41,4,41,13],[41,15,41,23],[41,28,41,31],[41,35,41,43],[42,7,42,38],[39,4,39,12],[39,17,39,22],[39,27,39,32],[39,37,39,42],[40,2,40,3],[40,4,40,13],[40,28,40,31],[37,2,38,14],[37,15,38,24],[37,26,37,33],[37,35,37,44],[38,25,38,34],[38,35,38,44],[35,2,35,3],[35,4,35,13],[35,15,35,23],[35,28,35,31],[35,35,35,43],[36,7,36,38],[33,4,33,12],[33,17,33,22],[33,27,33,32],[33,37,33,42],[34,2,34,3],[34,4,34,13],[34,28,34,31],[30,7,30,38],[31,2,32,14],[31,15,32,24],[31,26,31,33],[31,35,31,44],[32,25,32,34],[32,35,32,44],[28,2,28,14],[28,15,29,15],[28,25,28,35],[28,36,29,36],[29,2,29,14],[29,25,29,35],[26,2,26,14],[26,15,27,15],[26,25,26,35],[26,36,27,36],[27,2,27,14],[27,25,27,35],[26,16,27,22],[24,2,24,14],[24,15,25,15],[24,25,24,35],[24,36,25,36],[25,2,25,14],[25,25,25,35],[21,2,21,14],[21,15,23,15],[21,25,21,35],[21,36,23,36],[22,2,22,14],[22,27,23,29],[22,30,22,33],[23,2,23,14],[23,30,23,33],[19,2,19,14],[19,15,20,15],[19,25,19,35],[19,36,20,36],[20,6,20,10],[20,25,20,35],[16,27,16,35],[17,2,17,14],[17,15,18,15],[17,27,17,35],[17,36,18,36],[18,6,18,10],[18,27,18,35],[13,2,13,14],[13,15,16,15],[13,25,18,26],[13,27,13,35],[13,36,16,36],[14,6,16,10],[14,28,15,30],[14,31,14,32],[15,31,15,32],[7,45,27,45],[8,4,8,14],[8,28,9,30],[8,31,8,32],[9,4,9,14],[5,4,5,14],[5,15,6,15],[5,25,5,35],[5,36,6,36],[6,8,6,9],[6,24,26,24],[6,25,6,35],[7,4,7,14],[7,15,9,15],[1,45,6,45],[10,2,10,14],[10,15,12,15],[10,27,10,35],[10,36,12,36],[11,27,11,35],[12,2,12,14],[12,27,12,35],[7,25,12,26],[7,27,7,35],[3,15,4,15],[3,25,3,35],[3,36,4,36],[4,25,4,35],[4,37,4,43],[1,2,2,22],[1,23,2,26],[1,27,1,31],[1,32,2,35],[1,36,2,44],[2,27,2,31],[3,2,9,2],[3,3,9,3],[3,4,4,14],[7,36,9,36],[9,31,9,32],[4,16,4,22],[6,16,6,22],[8,16,9,22],[6,37,6,43],[8,37,9,43]]}
[]
[null,null,"雇用者給与等支給額が増加した場合の法人税額\nの特別控除に関する明細書",null,null,null,null,null,null,null,null,null,null,null,null,null,null,null,null,null,null,null,null,"事　業\n年　度",null,null,null,{"$f":"基本情報!D11","v":"2017-10-01"},null,null,null,null,"法人名",null,null,null,{"$f":"基本情報!C7","v":"株式会社今野デザイン"},null,null,null,null,null,null,null,null,"別表六（二十三）"]
[null,null,null,null,null,null,null,null,null,null,null,null,null,null,null,null,null,null,null,null,null,null,null,null,null,null,null,{"$f":"基本情報!C11","v":"2018-09-30"},null,null,null,null,null,null,null,null,null,null,null,null,null,null,null,null,null,null,null,null,null,null,null,"中小企業者等に"]
[null,null,"調整前雇用者給与等","支給増加額の計算","雇用者給与等支給額",null,null,null,null,null,null,null,null,null,null,1,null,null,null,null,null,0,null,"円",null,"調整前税額控除限度額",null,null,null,null,null,null,null,null,null,null,12,null,null,0,null,null,null,null,"円",null,null,null,null,null,null,{"$f":"基本情報!C9","v":"該当"},null,{"$f":"IF(AZ4=\"該当\",1,0)","v":1}]
[null,null,null,null,null,null,null,null,null,null,null,null,null,null,null,null,{"$f":"T48","v":13386900},null,null,null,null,null,null,null,null,"(11)×10/100\n((6)≦(7)の場合は0)",null,null,null,null,null,null,null,null,null,null,null,{"$f":"IF(Q19<=Q21,0,ROUNDDOWN(Q30*10/100,0))","v":136935},null,null,null,null,null,null,null,null,null,null,null,null,null,{"$f":"基本情報!C13","v":"平成２９年４月以降開始"},null,{"$f":"IF(AZ5=\"平成２９年４月以降開始\",1,0)","v":1}]
[null,null,null,null,"基準雇用者給与等支給額",null,null,null,null,null,null,null,null,null,null,2,null,null,null,null,null,0,null,null,null,"税額控除加算基準額",null,null,null,null,null,null,null,null,null,null,13]
[null,null,null,null,null,null,null,null,"(26)",null,null,null,null,null,null,null,{"$f":"IF(ISERROR(AJ36),0,AJ36)","v":12017550},null,null,null,null,null,null,null,"法人税額の特別控除額の計算","(((1)-(5))と(11)のうち少ない金額）",null,null,null,null,null,null,null,null,null,null,null,{"$f":"IF(MIN(Q5-Q15,Q30)<0,0,MIN(Q5-Q15,Q30))","v":1369350},null,null,null,null,null,null,null,null,null,null,null,null,null,"H29年3月以前","H29年4月以後"]
[null,null,null,null,"調整前雇用者給与等支給増加額",null,null,null,null,null,null,null,null,null,null,3,null,null,null,null,null,null,null,null,null,"以外の法人\n中小企業者等",null,"税額控除加算額",null,null,null,null,null,null,null,null,14,null,null,null,null,null,null,null,null,"平二十九・四・一以後終了事業年度分",null,null,null,null,null,null,{"$f":"ROUNDDOWN(AL7*2/100,0)","v":27387}]
[null,null,null,null,"(1)－(2)",null,null,null,null,null,null,null,null,null,null,null,{"$f":"IF(Q5-Q7<0,0,Q5-Q7)","v":1369350},null,null,null,null,null,null,null,null,null,null,null,"(13)×",null,null,2,null,null,null,null,null,{"$f":"IF(BB4=1,\"\",IF(BB5=1,BA8,AZ8))","v":""}]
[null,null,null,null,"(マイナスの場合は0)",null,null,null,null,null,null,null,null,null,null,null,null,null,null,null,null,null,null,null,null,null,null,null,null,null,null,100]
{"$rows_left_out":50}
{"sheet":"別表６（２３）Ｈ３０","index":5,"n_rows":69,"n_cols":30,"rows_kept":69,"cut":false,"hidden":false,"merged":[[64,22,67,23],[66,12,67,20],[67,2,67,6],[61,21,63,21],[61,22,63,23],[62,2,62,6],[62,12,63,20],[63,2,63,6],[63,11,67,11],[57,1,67,1],[57,2,58,6],[57,7,58,7],[57,8,58,9],[57,13,57,20],[57,21,58,21],[64,2,64,6],[64,7,67,7],[64,8,67,10],[64,12,65,20],[58,13,58,20],[59,2,59,6],[59,7,60,7],[59,8,60,9],[59,12,59,20],[64,21,67,21],[54,8,56,9],[54,13,54,20],[54,21,56,21],[61,2,61,6],[61,7,63,7],[61,8,63,9],[61,12,61,20],[54,22,56,23],[55,3,56,4],[55,16,56,16],[55,17,56,17],[55,18,55,19],[56,18,56,19],[59,21,60,21],[59,22,60,23],[60,2,60,6],[60,12,60,20],[57,22,58,23],[46,1,56,1],[46,2,49,6],[46,7,49,7],[46,8,49,9],[46,12,58,12],[46,13,53,14],[46,15,46,20],[46,21,49,21],[46,22,49,23],[47,17,48,17],[47,18,48,18],[49,15,49,20],[50,2,51,6],[50,7,53,7],[50,8,53,9],[50,15,50,20],[50,21,53,21],[50,22,53,23],[51,17,52,17],[51,18,52,18],[52,2,53,6],[53,15,53,20],[54,2,54,6],[54,7,56,7],[39,12,40,12],[39,13,39,20],[39,21,41,21],[39,22,41,23],[40,2,40,6],[40,13,41,20],[41,2,41,6],[42,2,42,6],[42,7,45,7],[42,8,45,10],[42,13,42,20],[42,21,45,21],[42,22,45,23],[43,13,44,20],[45,2,45,6],[45,13,45,20],[34,1,45,1],[34,2,34,6],[34,7,36,7],[34,8,36,9],[34,10,35,10],[34,13,34,20],[34,21,36,21],[34,22,36,23],[35,2,36,6],[35,16,36,16],[35,17,36,17],[35,18,35,19],[36,18,36,19],[37,2,37,6],[37,7,38,7],[37,8,38,9],[37,13,37,20],[37,21,38,21],[37,22,38,23],[38,2,38,6],[38,13,38,20],[39,2,39,6],[39,7,41,7],[39,8,41,9],[25,15,26,20],[27,15,27,20],[27,21,30,21],[31,1,31,6],[31,7,33,7],[31,8,33,10],[31,15,31,20],[27,22,30,23],[28,1,29,6],[28,17,29,17],[28,18,29,18],[30,1,30,6],[30,15,30,20],[27,1,27,6],[27,7,30,7],[27,8,30,9],[27,13,33,14],[31,21,33,21],[31,22,33,23],[32,15,32,20],[33,15,33,20],[17,21,19,21],[17,22,19,23],[18,13,19,20],[19,1,19,6],[20,1,20,6],[20,7,22,7],[20,8,22,9],[20,12,37,12],[20,13,26,13],[20,14,26,14],[20,15,20,20],[20,21,22,21],[20,22,22,23],[21,1,22,6],[21,17,22,17],[21,18,22,18],[23,1,24,6],[23,7,26,7],[23,8,26,9],[23,15,23,20],[23,21,26,21],[23,22,26,23],[24,15,24,20],[25,1,26,6],[14,16,15,16],[14,17,15,17],[14,18,14,19],[15,12,16,12],[15,18,15,19],[16,13,16,20],[17,1,18,6],[17,7,19,7],[17,8,19,9],[17,10,18,10],[17,12,18,12],[17,13,17,20],[8,7,9,7],[8,8,9,9],[8,13,8,20],[8,21,9,21],[8,22,9,23],[8,25,67,27],[9,1,9,6],[9,12,10,12],[9,13,9,20],[10,1,10,6],[10,7,12,7],[10,8,12,9],[10,13,10,20],[10,21,12,21],[10,22,12,23],[11,1,11,6],[11,12,12,12],[11,13,11,20],[12,1,12,6],[12,13,12,20],[13,13,13,20],[13,21,16,21],[13,22,16,23],[13,24,15,24],[4,1,5,9],[4,10,4,11],[4,12,4,17],[4,18,5,19],[4,20,5,24],[4,25,5,27],[5,10,5,11],[5,12,5,17],[6,1,7,6],[6,7,7,7],[6,8,7,9],[6,11,62,11],[6,12,6,20],[6,21,7,21],[13,1,14,6],[13,7,16,7],[13,8,16,10],[13,12,14,12],[6,22,7,23],[6,25,7,25],[6,26,7,26],[6,27,7,27],[7,12,7,20],[8,1,8,6]]}
[]
[]
[]
[]
[null,"雇用者給与等支給額が増加した場合又は給与等\nの引き上げ及び設備投資を行った場合の法人税額\nの特別控除に関する明細書",null,null,null,null,null,null,null,null,"事　業",null,{"$f":"'別表６（２３）'!AB2:AB2","v":"2017-10-01"},null,null,null,null,null,"法人名",null,{"$f":"'別表６（２３）'!AK2:AK2","v":"株式会社今野デザイン"},null,null,null,null,"別表六"]
[null,null,null,null,null,null,null,null,null,null,"年　度",null,{"$f":"'別表６（２３）'!AB3:AB3","v":"2018-09-30"}]
[null,"雇用者給与等支給額",null,null,null,null,null,1,{"$f":"'別表６（２３）'!Q5:Q5","v":13386900},null,"円"," 法人税額の特別控除額の計算  ","調整前法人税額",null,null,null,null,null,null,null,null,21,{"$f":"'別表６（２３）'!AL21:AL21","v":2000000},null,"円","(","二十三",")"]
[null,null,null,null,null,null,null,null,null,null,null,null,"(別表一(一)｢2｣､別表一(二)｢2｣又は別表一(三)｢2｣又は別表一の三｢2｣若しくは｢13｣)"]
[null,"基準雇用者給与等支給額",null,null,null,null,null,2,{"$f":"'別表６（２３）'!Q7:Q7","v":12017550},null,null,null,null,"雇用者給与等支給増加重複控除額",null,null,null,null,null,null,null,22,{"$f":"'別表６（２３）'!Q27:Q27","v":0},null,null," 平三十・四・一以後終了事業年度分"]
[null,"(別表六(二十三)付表一｢4｣)",null,null,null,null,null,null,null,null,null,null,"平成","（別表六(二十三)付表二｢7｣）"]
{"$rows_left_out":60}
{"sheet":"別表６（２３）付表１Ｈ３０","index":6,"n_rows":70,"n_cols":39,"rows_kept":70,"cut":false,"hidden":false,"merged":[[4,1,5,14],[4,15,4,16],[4,17,4,22],[4,23,5,24],[4,25,5,33],[4,34,5,36],[5,15,5,16],[5,17,5,22],[7,26,8,26],[8,34,9,36],[9,2,10,7],[9,8,10,8],[9,9,10,14],[9,17,10,25],[9,26,10,26],[6,5,6,29],[6,34,7,34],[6,35,7,35],[6,36,7,36],[7,2,8,7],[7,8,8,8],[7,16,15,16],[7,17,8,25],[9,27,9,32],[10,27,10,32],[10,34,28,36],[11,2,11,7],[11,8,13,8],[11,11,12,13],[11,17,11,25],[11,26,13,26],[11,29,12,31],[12,2,13,7],[12,17,13,25],[13,11,13,13],[13,29,13,31],[14,2,14,7],[14,8,15,8],[14,9,15,14],[14,17,14,25],[14,26,15,26],[14,27,15,32],[15,2,15,7],[20,1,21,8],[20,9,21,9],[21,10,21,20],[21,24,21,32],[22,1,23,8],[22,9,23,9],[22,10,23,20],[22,24,23,32],[15,17,15,25],[16,5,16,29],[17,1,19,9],[17,10,17,21],[17,22,17,33],[18,10,18,21],[18,22,18,33],[19,10,19,21],[19,22,19,33],[7,1,15,1],[24,1,25,8],[24,9,25,9],[24,10,25,20],[24,24,25,32],[26,1,26,8],[26,9,27,9],[26,10,27,20],[26,24,27,32],[27,1,27,8],[28,1,29,8],[28,9,29,9],[28,10,29,20],[28,24,29,32],[30,1,30,8],[30,9,32,9],[30,10,32,20],[30,21,31,21],[30,24,32,32],[36,26,36,33],[37,1,38,8],[37,9,38,9],[37,10,38,17],[37,18,37,25],[37,26,37,33],[38,18,38,25],[38,26,38,33],[30,33,31,33],[33,5,33,29],[34,1,36,9],[34,10,34,17],[34,18,34,33],[35,10,35,17],[35,18,35,25],[35,26,35,33],[36,10,36,17],[36,18,36,25],[39,1,40,8],[39,9,40,9],[40,10,40,16],[40,18,40,24],[40,26,40,32],[41,1,42,8],[41,9,42,9],[41,10,42,16],[41,18,42,24],[41,26,42,32],[45,1,45,8],[45,9,47,9],[46,1,46,8],[46,10,47,16],[46,18,47,24],[46,26,47,32],[47,1,47,8],[43,1,43,8],[43,9,44,9],[43,10,44,17],[43,18,44,25],[43,28,43,31],[44,1,44,8],[44,28,44,31],[48,5,48,29],[49,1,50,7],[49,8,50,8],[49,9,50,15],[49,25,52,25],[49,26,52,32],[50,17,50,24],[51,1,51,7],[51,8,52,8],[51,9,52,15],[51,17,51,24],[52,1,52,7],[53,5,53,29],[54,1,56,8],[54,9,56,17],[54,18,54,25],[54,26,55,33],[55,18,56,25],[56,26,56,33],[60,9,61,16],[60,21,60,23],[60,26,61,32],[61,2,61,8],[61,21,61,23],[57,1,57,8],[57,9,57,17],[57,18,57,25],[57,26,57,33],[58,1,65,1],[58,2,58,8],[58,9,59,16],[58,21,58,23],[58,26,59,32],[59,2,59,8],[7,10,7,15],[8,10,8,15],[7,28,7,33],[8,28,8,33],[66,1,66,25],[66,26,66,32],[67,1,67,24],[67,25,68,25],[67,26,68,32],[68,1,68,24],[64,2,64,8],[64,9,65,16],[64,21,64,23],[64,26,65,32],[65,2,65,8],[65,21,65,23],[62,2,62,8],[62,9,63,16],[62,21,62,23],[62,26,63,32],[63,2,63,8],[63,21,63,23],[59,21,59,23],[60,2,60,8]]}
[]
[]
[]
[]
[null,"給与等支給額、当期償却費総額及び比較教育訓練\n費の額の計算に関する明細書",null,null,null,null,null,null,null,null,null,null,null,null,null,"事　業",null,{"$f":"'別表６（２３）'!AB2:AB2","v":"2017-10-01"},null,null,null,null,null,"法人名",null,{"$f":"'別表６（２３）'!AK2:AK2","v":"株式会社今野デザイン"},null,null,null,null,null,null,null,null,"別表六"]
[null,null,null,null,null,null,null,null,null,null,null,null,null,null,null,"年　度",null,{"$f":"'別表６（２３）'!AB3:AB3","v":"2018-09-30"}]
[null,null,null,null,null,"給与等支給額の計算に関する明細",null,null,null,null,null,null,null,null,null,null,null,null,null,null,null,null,null,null,null,null,null,null,null,null,null,null,null,null,"(","二十三",")"]
[null,"基準雇用者給与等支給額の計算","基準事業年度又は\n基準連結事業年度等",null,null,null,null,null,1,"平",{"$f":"'別表６（２３）'!E35:E35","v":"2012-10-01"},null,null,null,null,null,"比較雇用者給与等支給額の計算","前事業年度又は前連結事業年度",null,null,null,null,null,null,null,null,5,"平",{"$f":"'別表６（２３）'!E41:E41","v":"2016-10-01"}]
[null,null,null,null,null,null,null,null,null,"平",{"$f":"'別表６（２３）'!E36:E36","v":"2013-09-30"},null,null,null,null,null,null,null,null,null,null,null,null,null,null,null,null,"平",{"$f":"'別表６（２３）'!E42:E42","v":"2017-09-30"},null,null,null,null,null,"付表一"]
[null,null,"国内雇用者に対する\n給与等の支給額",null,null,null,null,null,2,{"$f":"'別表６（２３）'!P36:P36","v":12017550},null,null,null,null,null,"円",null,"国内雇用者に対する\n給与等の支給額",null,null,null,null,null,null,null,null,6,null,null,null,null,null,null,"円"]
{"$rows_left_out":61}
{"sheet":"計算基礎シート","index":7,"n_rows":28,"n_cols":12,"rows_kept":28,"cut":false,"hidden":true,"merged":[]}
[]
[]
[null,null,null,null,null,"在職中",{"$f":"G28","v":"2018-09-30"},"なくなった月",null,"なった月"]
[null,"前年度",null,null,"適用年度",{"$f":"F5&\"前退職\"","v":"2016年10月前退職"},{"$f":"G5-1","v":"2016-09-30"},1]
[1,{"$f":"基本情報!G11","v":"2016-10-01"},{"$f":"YEAR(B5)&\"年\"&MONTH(B5)&\"月以前\"","v":"2016年10月以前"},{"$f":"B5","v":"2016-10-01"},{"$f":"D5","v":"2016-10-01"},{"$f":"YEAR(E5)&\"年\"&MONTH(E5)&\"月\"","v":"2016年10月"},{"$f":"E5","v":"2016-10-01"},2,{"$f":"C5","v":"2016年10月以前"},1,null,"退職"]
[2,{"$f":"EOMONTH(B5,1)","v":"2016-11-30"},{"$f":"YEAR(B6)&\"年\"&MONTH(B6)&\"月\"","v":"2016年11月"},{"$f":"B6","v":"2016-11-30"},{"$f":"EOMONTH(E5,1)","v":"2016-11-30"},{"$f":"YEAR(E6)&\"年\"&MONTH(E6)&\"月\"","v":"2016年11月"},{"$f":"E6","v":"2016-11-30"},2,{"$f":"C6","v":"2016年11月"},1,null,"継続雇用制度に移行"]
[3,{"$f":"EOMONTH(B6,1)","v":"2016-12-31"},{"$f":"YEAR(B7)&\"年\"&MONTH(B7)&\"月\"","v":"2016年12月"},"2016-12-31",{"$f":"EOMONTH(E6,1)","v":"2016-12-31"},"2016年12月","2016-12-31",2,"2016年12月",1]
[4,"2017-01-31","2017年1月","2017-01-31","2017-01-31","2017年1月","2017-01-31",2,"2017年1月",1]
[5,"2017-02-28","2017年2月","2017-02-28","2017-02-28","2017年2月","2017-02-28",2,"2017年2月",1]
[6,"2017-03-31","2017年3月","2017-03-31","2017-03-31","2017年3月","2017-03-31",2,"2017年3月",1]
{"$rows_left_out":18}